program: Gaussian 09
title: 000242801
version: EM64L-G09RevD.01
frameworkgroup: C1[X(C6H12O3S)]
method: RPBEPBE
basis: SDD
operation: Freq
keyword: #p
keyword: freq=noraman
keyword: PBEPBE/SDD
title: #p freq=noraman PBEPBE/SDD
converged: YES YES NO NO
title: Mulliken charges:
elementType: S O O O C C C C C C H H H H H H H H H H H H
charge: 0.945627 -0.277345 -0.556874 -0.573021 -0.599126 -0.599128 0.039235 0.039237 -0.698578 -0.698580 0.287393 0.275036 0.275037 0.287394 0.240895 0.240896 0.214028 0.243862 0.228061 0.243861 0.214028 0.228061
chargesum: 0.00000
title: Mulliken charges with hydrogens summed into heavy atoms:
elementType: S O O O C C C C C C
charge: 0.945627 -0.277345 -0.556874 -0.573021 -0.036697 -0.036697 0.280130 0.280133 -0.012627 -0.012629
polarizability: 1.07906805e+02 8.90133359e-06 1.04824989e+02 3.46860703e+00 -6.09384846e-05 8.44544835e+01
1716.lowfreq: -24.9842 -8.8454 -5.0624 -0.0027 -0.0024 -0.0020 92.2870 97.2958 154.7316
frequency: 92.2179 97.2945 154.7254 185.5931 187.9081 192.3872 223.9407 228.7412 243.5848 288.6220 360.9490 363.3683 375.1470 435.5290 452.7638 482.6618 603.3178 647.1877 759.8617 787.9961 828.0443 879.4929 889.2053 896.9625 929.8949 944.3903 1011.9384 1039.0376 1078.4936 1108.2737 1110.9082 1151.7916 1152.6427 1171.8513 1203.3045 1232.8669 1301.2411 1319.5075 1330.8811 1368.2548 1387.3943 1390.5866 1395.7097 1400.1411 1457.3012 1457.7949 1474.4781 1476.5377 2965.6200 2965.8997 2996.9632 2997.2129 3046.4761 3047.8356 3098.0858 3098.2762 3105.4589 3105.8605 3143.3056 3145.2207
redmass: 3.6385 4.5637 2.2145 1.3135 2.3856 1.4619 2.8219 3.3161 3.6340 4.0779 5.2239 2.8768 9.7413 3.8990 2.1873 2.8944 3.9857 4.7933 3.0072 9.8015 2.2091 1.6795 2.2559 1.9703 3.2331 2.4511 1.4502 1.7331 2.4385 1.8972 1.8420 1.6117 2.0524 1.5503 1.2571 1.2665 1.2036 1.3043 1.4227 1.2136 1.1963 1.2370 1.1290 1.1166 1.0463 1.0458 1.0481 1.0487 1.0855 1.0840 1.0354 1.0354 1.0555 1.0560 1.1002 1.1000 1.1004 1.1002 1.1099 1.1107
irintensity: 1.5865 10.1385 2.9395 2.1533 5.0283 0.3751 0.8089 4.3855 5.4676 4.0784 38.6680 1.7478 15.8950 7.6771 0.0394 5.2220 1.7869 17.6263 10.4424 55.1576 0.1578 5.6585 32.5061 5.7470 46.9876 34.1292 41.8920 36.5508 30.7629 35.1947 9.9548 7.7905 31.8314 12.8141 0.7577 4.8493 11.2081 4.9331 2.8951 8.1512 13.6814 11.7119 16.2348 11.3828 0.0001 22.3944 7.6943 12.2627 5.5555 28.1070 23.9267 9.8010 1.3258 2.6000 11.4376 29.2970 1.7003 33.9914 0.9406 2.2138
temp: 298.150 k
press: 1.00000 atm
elementType: 16 8 8 8 6 6 6 6 6 6 1 1 1 1 1 1 1 1 1 1 1 1
symmnumber: 1
zpe: 462170.9 jmol-1
zpe.correction: 0.176032 hartree
zpe.thermalcorrener: 0.187628 hartree
zpe.thermalcorrenthalpy: 0.188572 hartree
zpe.thermalcorrgfe: 0.139385 hartree
zpe.sumelectzpe: -858.583997 hartree
zpe.sumelectthermal: -858.572401 hartree
zpe.sumelectthermalent: -858.571457 hartree
zpe.sumelectthermalfe: -858.620644 hartree
dipole: 5.0295 0.0000 -1.0934
dipole: 5.1470
quadrupole: -85.9767 -56.3796 -73.9719
quadrupole: 0.0001 2.4254 0.0003
quadrupole: -13.8673 15.7298 -1.8625 0.0001 2.4254 0.0003
hfenergy: -858.7600287 hartree
pointgroup: C01 [X(C6H12O3S1)]
dipole: -1.9779665 -0.0002287 0.4338333 debye
dipolederiv: 1.3521341 0.000024 -0.023996 0.0000202 1.1764895 -0.0000043 -0.037329 -0.000007 1.1566612 -0.4883077 0.0000685 -0.08644 0.0000692 -0.9990095 0.0000588 -0.0494848 0.0000642 -0.3406274 -0.7869902 -0.0000379 -0.0461432 -0.0000575 -0.5685528 -0.0000076 -0.2130197 -0.0000309 -0.5631771 -0.5897938 -0.0000047 -0.0115465 0.0000146 -0.5741034 -0.0000161 0.1391174 0.0000052 -0.6848563 -0.1878509 -0.0514305 -0.0119057 -0.0225713 -0.1188182 -0.0062175 -0.0410424 0.0093681 -0.0841015 -0.1878753 0.0513978 -0.0119169 0.0225339 -0.1188003 0.0062203 -0.0410454 -0.0093665 -0.0841047 0.3889547 0.1365457 0.034244 0.2058778 0.5151845 -0.0575198 0.172311 -0.2263066 0.2664072 0.3890522 -0.1365777 0.0342597 -0.2058706 0.5151451 0.057477 0.1722928 0.2262976 0.2663345 -0.1076656 0.1465203 0.0026057 -0.0078654 -0.0266767 -0.022049 -0.0702009 0.0431208 0.0851834 -0.1076213 -0.1465377 0.0026257 0.0078272 -0.0267187 0.0220707 -0.0701927 -0.0431216 0.0851908 0.0417965 -0.0399598 0.0133442 -0.0461825 -0.0170662 0.0165436 0.0234616 0.0181546 0.080241 0.0284357 0.0501753 0.034854 0.0527761 0.049278 -0.0080156 -0.0108013 -0.0029846 -0.0408074 0.0284674 -0.0501729 0.0348648 -0.0527843 0.0492517 0.0080027 -0.0107882 0.0029576 -0.0408078 0.0417704 0.0399832 0.0133401 0.0462064 -0.0170485 -0.0165157 0.0234556 -0.0181232 0.080251 0.0411247 -0.0480689 0.0476748 -0.0114496 -0.009003 -0.0589082 0.0011968 0.0388408 -0.1077881 0.041111 0.0480955 0.0476495 0.0114658 -0.0089782 0.0589027 0.0012077 -0.0388579 -0.1077833 0.0661279 -0.1021585 0.0448516 -0.052 -0.0863339 0.0507553 0.0392852 0.0562834 0.0783724 -0.1064724 0.038237 -0.0765347 -0.0126232 0.0804481 -0.0324053 -0.0818242 -0.0260091 0.0563666 0.0919869 0.0177684 -0.005077 0.0057389 0.0955893 0.0225221 0.0479763 -0.0366588 -0.1178494 -0.1064578 -0.0383049 -0.0765385 0.0125537 0.0804513 0.0323803 -0.0818396 0.0259803 0.0563496 0.0660816 0.1022105 0.0448451 0.0520511 -0.0863129 -0.0507082 0.0392909 -0.0562372 0.0783953 0.0919919 -0.0177725 -0.0050608 -0.0057305 0.0955849 -0.0225663 0.047973 0.0366308 -0.1178502 unknown
polarizability: 107.9195211|0.0007911|104.8249885|3.4253254|-0.0014868|84.4417677 unknown
InChI: InChI=1S/C6H12O3S/c1-5-3-10(7,8)4-6(2)9-5/h5-6H,3-4H2,1-2H3
charge 0 multiplicity 1
22 atoms
S  1.634936 0.000309 -0.037067
O  -1.525106 -0.000132 0.251398
O  2.950548 0.000622 0.93181
O  1.757671 0.000126 -1.67479
C  0.469661 1.474003 0.425808
C  0.470099 -1.473617 0.426163
C  -0.894218 1.245916 -0.246836
C  -0.893831 -1.246097 -0.246565
C  -1.872815 2.380441 0.074617
C  -1.872107 -2.380842 0.075089
H  1.002181 2.36234 0.049878
H  0.423273 1.456537 1.526103
H  0.423684 -1.45589 1.526452
H  1.002892 -2.361888 0.050463
H  -0.741195 1.165734 -1.345293
H  -0.740798 -1.166093 -1.345034
H  -1.478261 3.351348 -0.273655
H  -2.834902 2.189414 -0.429505
H  -2.057402 2.439755 1.161334
H  -2.834235 -2.190187 -0.429098
H  -1.477267 -3.351704 -0.272984
H  -2.056707 -2.439994 1.161812
