program: Gaussian 09
title: 000242794
version: EM64L-G09RevD.01
frameworkgroup: C1[X(C14H22O)]
method: RPBEPBE
basis: SDD
operation: Freq
keyword: #pfreq=noraman
keyword: PBEPBE/SDD
title: #p freq=noraman PBEPBE/SDD
converged: YES YES NO NO
title: Mulliken charges:
elementType: O C C C C C C C C C C C C C C H H H H H H H H H H H H H H H H H H H H H H
charge: -0.478947 0.135257 -0.463396 -0.348350 -0.377452 -0.366007 0.413229 -0.731585 -0.370536 -0.406795 -0.399624 -0.694058 -0.251737 -0.222653 -0.244674 0.201474 0.192991 0.209077 0.214702 0.197792 0.184065 0.199977 0.188415 0.248702 0.218781 0.198649 0.192376 0.200663 0.336975 0.223674 0.289537 0.217915 0.213217 0.208039 0.222224 0.222794 0.225287
chargesum: 0.00000
title: Mulliken charges with hydrogens summed into heavy atoms:
elementType: O C C C C C C C C C C C C C C
charge: -0.141972 0.135257 -0.068932 0.075429 0.004405 0.022385 0.413229 -0.065452 0.022503 -0.183120 -0.110086 -0.054886 -0.029512 0.000141 -0.019387
polarizability: 1.56490001e+02 2.35192292e+01 1.51647968e+02 -2.72613711e+00 -2.95236717e-01 1.40609187e+02
1716.lowfreq: -10.6983 -6.1683 0.0007 0.0007 0.0008 8.6588 18.0860 30.1029 34.8842
frequency: 17.2402 29.8965 34.8280 73.7935 90.7441 107.6372 133.5388 159.9720 178.4518 214.8589 248.1587 248.6802 253.6983 275.3654 300.5574 326.4301 340.2878 375.5102 402.7433 434.4635 466.0836 492.1597 546.5071 584.7653 617.2290 706.0511 708.1828 727.0913 753.5081 771.2643 781.9944 842.9383 855.7088 866.1732 892.8200 911.8638 925.7689 965.6117 978.5057 989.9245 990.9573 999.8402 1012.2603 1026.5278 1040.1867 1063.4128 1072.4073 1081.3685 1097.8620 1115.4081 1134.6876 1146.8426 1169.8934 1173.3892 1177.1434 1190.6562 1232.7650 1247.1504 1269.0553 1289.3099 1290.9379 1309.9479 1315.2696 1338.9299 1347.6217 1357.2170 1359.9061 1380.0581 1385.1026 1387.5397 1433.5709 1453.5391 1459.8593 1465.7276 1466.9793 1468.3118 1469.2493 1478.6766 1485.1923 1486.6558 1489.4136 1590.9550 1614.1749 2946.7671 2950.5673 2957.5478 2966.1422 2973.7329 2974.7940 2981.2093 2993.1402 3006.1729 3015.0669 3024.4004 3049.9543 3067.6010 3068.0212 3075.6812 3096.8419 3113.2455 3125.0750 3138.4287 3157.3869 3181.1533 3565.0434
redmass: 2.5306 3.6287 4.0277 2.9158 3.1096 1.8208 2.0994 2.5521 2.4340 2.9279 2.3914 1.1066 1.5190 1.0839 2.4627 3.5429 3.1131 3.1858 2.8428 2.9365 3.4221 2.8719 3.2923 3.2121 6.4096 1.9368 3.5481 1.1242 1.2129 1.7117 1.4233 2.2344 1.2551 2.3861 1.4765 1.8664 1.4269 1.7830 1.3670 3.9028 1.5439 1.3202 3.6389 2.4412 1.4339 2.2569 2.2295 1.5647 2.2594 1.8287 2.2338 2.0073 1.3052 1.6168 1.7620 1.1497 1.3258 1.3459 1.2373 1.1087 1.1492 1.3219 1.3385 1.4966 1.5503 1.5754 1.6442 4.4082 1.3881 1.2213 2.2277 1.0783 1.0695 1.0873 1.1141 1.0697 1.0955 1.0518 1.2077 1.7183 1.0592 6.2556 6.0954 1.0618 1.0607 1.0596 1.0617 1.0377 1.0375 1.0595 1.0954 1.0959 1.0994 1.1032 1.1039 1.0992 1.0968 1.0996 1.0999 1.0861 1.0873 1.0936 1.0992 1.0949 1.0657
irintensity: 0.0293 0.1353 0.0012 0.2396 1.5925 0.0549 0.7958 0.2921 2.8781 2.4537 0.1972 5.8339 0.4498 136.3111 16.4362 4.5746 8.4615 2.6413 0.3187 5.7633 1.4820 2.6825 8.6260 21.8275 0.0934 48.8275 15.1507 8.0975 7.2946 27.9070 14.7688 20.9746 0.2678 3.3414 13.0996 1.2429 6.3409 1.4306 0.8285 0.2165 2.1553 1.1596 4.6038 19.9526 30.5383 3.5882 2.1036 7.4029 1.9547 9.0023 24.6402 48.0238 4.7136 4.6353 12.0743 0.7938 12.0169 6.3791 2.1780 0.5443 1.8067 1.3652 2.0481 1.9387 4.6920 11.8035 15.5207 5.8623 10.6410 17.4894 15.1924 0.8053 1.9665 8.0336 1.0016 4.2072 0.7719 10.9609 4.6738 25.3657 19.1899 0.7348 6.4341 11.7471 17.2022 56.2520 37.5593 33.1943 29.7014 44.6048 1.1241 18.2072 29.6039 29.5730 86.2878 58.1528 56.7595 69.2389 19.5042 10.3191 2.6702 39.4158 29.6286 5.2830 4.3857
temp: 298.150 k
press: 1.00000 atm
elementType: 8 6 6 6 6 6 6 6 6 6 6 6 6 6 6 1 1 1 1 1 1 1 1 1 1 1 1 1 1 1 1 1 1 1 1 1 1
symmnumber: 1
zpe: 851890.3 jmol-1
zpe.correction: 0.324468 hartree
zpe.thermalcorrener: 0.341332 hartree
zpe.thermalcorrenthalpy: 0.342276 hartree
zpe.thermalcorrgfe: 0.278228 hartree
zpe.sumelectzpe: -620.736102 hartree
zpe.sumelectthermal: -620.719238 hartree
zpe.sumelectthermalent: -620.718293 hartree
zpe.sumelectthermalfe: -620.782341 hartree
dipole: 0.8815 0.9954 -1.2154
dipole: 1.8014
quadrupole: -96.7993 -86.1703 -90.7756
quadrupole: 4.0811 1.9666 -0.0791
quadrupole: -5.5509 5.0781 0.4728 4.0811 1.9666 -0.0791
hfenergy: -621.0605695 hartree
pointgroup: C01 [X(C14H22O1)]
dipole: 0.3668226 0.3187094 -0.5159035 debye
polarizability: 157.3109349|22.9096634|150.9047387|-5.4213338|-0.990286|140.5314826 unknown
InChI: InChI=1S/C14H22O/c1-3-4-5-9-12-14(2,15)13-10-7-6-8-11-13/h6-8,10-11,15H,3-5,9,12H2,1-2H3
charge 0 multiplicity 1
37 atoms
O  -0.844016 2.148008 1.091022
C  -0.93405 1.532909 -0.259723
C  0.503505 1.192568 -0.756791
C  1.276284 0.205298 0.142723
C  2.749219 0.033324 -0.292172
C  3.522668 -0.964327 0.601162
C  -1.796416 0.272617 -0.099263
C  -1.619213 2.543785 -1.213372
C  4.985237 -1.218838 0.158708
C  -2.057767 -0.55143 -1.22456
C  -2.349994 -0.08753 1.15304
C  5.898795 0.023494 0.266969
C  -2.854834 -1.710498 -1.102149
C  -3.148849 -1.247798 1.276596
C  -3.405741 -2.064237 0.151947
H  0.442012 0.787359 -1.786912
H  1.07116 2.14583 -0.833469
H  1.23475 0.563023 1.190589
H  0.769718 -0.779688 0.129249
H  3.251584 1.02216 -0.273083
H  2.788258 -0.31669 -1.346011
H  2.974844 -1.929235 0.610394
H  3.518048 -0.594576 1.648164
H  -2.602849 2.834676 -0.806714
H  -1.773521 2.112107 -2.218222
H  -0.99811 3.454003 -1.328193
H  4.989522 -1.589713 -0.887008
H  5.4106 -2.032836 0.779513
H  -0.314306 2.98093 1.00801
H  -1.637694 -0.293448 -2.204726
H  -2.147214 0.549422 2.017406
H  5.56525 0.834096 -0.406129
H  6.94291 -0.223731 -0.000152
H  5.899177 0.421901 1.299558
H  -3.046019 -2.335283 -1.982244
H  -3.570548 -1.513325 2.253041
H  -4.0256 -2.962828 0.249103
