program: Gaussian 09
title: 000021247
version: EM64L-G09RevD.01
frameworkgroup: C1[X(C22H23N4O5S)]
method: RPBEPBE
basis: SDD
operation: Freq
keyword: #p
keyword: freq=noraman
keyword: PBEPBE/SDD
title: #p freq=noraman PBEPBE/SDD
converged: YES YES NO NO
title: Mulliken charges:
elementType: S O O O O O N N N N C C C C C C C C C C C C C C C C C C C C C C H H H H H H H H H H H H H H H H H H H H H H H
charge: 0.240167 -0.129242 -0.374845 -0.282252 -0.273255 -0.242897 -0.259009 -0.407575 -0.041400 -0.385187 -0.055837 -0.203676 -0.460741 0.100034 -0.515186 0.082628 0.388004 -0.634619 0.152659 0.231607 -0.586164 -0.144592 -0.125484 -0.103591 -0.280452 -0.302779 0.281789 -0.276078 0.218809 -0.119303 -0.497986 -0.596126 0.305938 0.293741 0.282463 0.227921 0.244591 0.235463 0.371547 0.311235 0.264745 0.272429 0.263989 0.344613 0.291547 0.412634 0.315957 0.256842 0.267799 0.257710 0.272659 0.318247 0.250771 0.250899 0.288837
chargesum: 1.00000
title: Mulliken charges with hydrogens summed into heavy atoms:
elementType: S O O O O O N N N N C C C C C C C C C C C C C C C C C C C C C C
charge: 0.240167 -0.129242 0.037789 -0.282252 -0.273255 -0.242897 -0.259009 -0.036028 -0.041400 -0.066940 0.250101 0.090065 0.049643 0.100034 -0.035132 0.082628 0.388004 -0.058639 0.152659 0.231607 -0.049746 0.200021 0.166063 -0.103591 0.035505 -0.045937 0.281789 -0.008279 0.218809 0.138407 -0.225326 0.194381
polarizability: 3.99743407e+02 5.37319724e+01 2.57430780e+02 2.39888813e+01 4.87651188e+00 2.91008286e+02
1716.lowfreq: -9.0927 -7.6144 -3.0252 -3.0003 -0.0016 -0.0016 0.0009 6.9926 10.5348
frequency: -8.0958 6.8540 10.2172 19.8880 25.7209 28.3069 37.5597 53.5722 59.4749 61.4528 71.3710 76.8077 79.5651 98.9155 113.9733 123.5965 152.6295 169.9062 173.9523 185.5110 200.4750 226.2592 238.5287 268.7956 279.1853 289.8167 295.9765 309.4827 328.7301 350.7357 364.3921 394.7457 400.7720 407.8621 422.0477 436.9612 460.6013 470.2214 486.3544 496.3610 513.3174 543.0663 561.2581 563.3696 569.2513 590.7017 601.6257 604.7918 624.4815 630.3358 652.1609 657.7220 664.0292 671.2464 684.5711 696.9490 706.0521 708.2451 724.8661 744.1990 751.5640 778.7183 816.8211 820.8430 830.1847 842.7278 850.8882 859.4719 903.2328 907.8436 915.1843 919.4155 925.0191 954.7855 966.5254 988.3572 991.7470 1001.2826 1009.4306 1012.4813 1034.3660 1039.2734 1044.1550 1064.3168 1082.2393 1082.2794 1101.3969 1109.9442 1118.2074 1119.0913 1125.0955 1136.3477 1143.3749 1152.5726 1170.6619 1183.2429 1196.5525 1198.7583 1214.9800 1222.0415 1233.8881 1242.7285 1244.9681 1252.9321 1263.8477 1291.5373 1293.4077 1309.0267 1319.7343 1320.8113 1340.3746 1341.6952 1349.3437 1362.7248 1381.0172 1391.5123 1425.8030 1431.6269 1444.5574 1445.8983 1451.7847 1458.0828 1467.6517 1470.7205 1478.3101 1482.6316 1495.1376 1516.9183 1548.5771 1552.6443 1582.0691 1592.3405 1599.6219 1604.2369 1629.8429 1735.6720 2935.8608 2993.3472 2998.6323 3003.1291 3005.0175 3018.1333 3037.8738 3059.3211 3066.3603 3086.3827 3098.1000 3122.1676 3132.1970 3164.3108 3170.6290 3173.8637 3188.1205 3189.2410 3199.9703 3240.1425 3501.8158 3523.0028 3556.1482
redmass: 5.5218 7.4146 5.4309 7.4412 5.3151 5.8348 5.6001 7.8545 6.3149 5.1550 4.6052 2.3130 1.6448 6.6087 4.4629 4.7399 4.5207 4.0914 7.1677 2.8782 5.6205 5.8568 7.9094 5.1407 2.4598 4.9532 4.3159 4.4334 6.0852 7.4735 6.9998 3.5848 2.7770 3.8680 3.0795 4.8726 5.0974 5.3614 3.0634 3.9422 4.1254 4.0647 3.3694 2.7150 1.2295 4.8214 1.5142 3.0001 1.9400 3.1425 3.6384 5.2022 3.7886 4.8430 4.3949 5.0032 1.8842 1.9378 4.5213 5.0004 6.3322 4.7910 3.4633 4.2498 3.0544 1.3810 1.5141 2.1407 1.4621 2.3052 1.9387 1.9137 2.5923 3.6294 1.4245 4.7907 4.7007 5.1770 1.8931 1.6052 3.9369 1.6969 2.6894 2.3195 1.4874 1.5978 5.1556 1.6810 1.6368 1.3070 1.6760 1.6574 1.8319 2.6567 1.6304 1.8650 1.7905 1.4951 1.5819 1.3788 1.5449 1.3243 1.6849 1.6794 2.4996 1.4548 1.4668 2.3160 1.5228 1.4776 1.4870 2.2002 1.3619 1.7307 2.5810 4.8106 1.1884 1.1360 1.1591 1.3255 1.4439 1.5297 2.1187 1.0910 6.8663 1.0443 1.6567 1.5758 5.9789 6.0551 6.5132 8.5305 8.1190 8.1282 5.3003 12.7183 1.0663 1.0837 1.0347 1.0799 1.0629 1.0780 1.0636 1.0868 1.0975 1.1029 1.1001 1.1020 1.0999 1.0924 1.0911 1.0933 1.0987 1.0956 1.0984 1.1007 1.0785 1.0650 1.0776
irintensity: 1.0635 0.3470 2.1165 0.4001 9.7605 0.6962 0.2334 1.9481 3.6917 5.0029 4.1600 6.4645 0.3921 2.3032 6.4667 2.3262 2.7490 2.9592 4.6105 1.2733 3.1781 3.5777 2.3743 2.7879 2.9017 4.1624 0.5920 14.0753 1.1169 5.0224 21.3961 23.7225 0.7631 0.8002 1.7816 6.8968 1.6661 14.4973 3.0872 7.1124 7.1255 18.5715 2.1923 23.1087 131.7538 9.2891 44.5416 10.9932 67.2935 49.0345 14.8975 7.5589 12.6699 15.9053 44.6696 6.2319 52.1117 68.5616 9.6544 19.8715 11.6331 12.4257 6.7227 10.8502 6.6146 17.9843 20.1790 1.7683 37.2675 7.4706 1.0347 4.4114 3.0654 12.8544 1.9032 91.9689 21.2410 35.9078 26.9083 9.5966 254.2317 17.8418 3.2644 5.4503 67.8103 39.8053 81.4881 6.6317 7.6048 0.1976 13.2565 47.2743 19.0990 2.7442 13.2818 19.4087 1.7305 2.3764 22.3205 3.8711 35.9791 12.0955 6.4916 25.3853 70.2639 7.0718 51.0534 100.4097 23.0414 26.4454 21.2217 0.7814 6.0023 54.9250 20.2847 380.5166 19.2733 100.9984 16.6379 56.2432 41.9692 31.4528 226.0524 17.3226 11.1994 21.5333 68.8358 61.3997 30.7073 6.0950 228.0934 218.8345 185.8738 67.3044 35.2280 513.1689 35.2569 17.9861 22.8305 6.5708 6.2319 20.8754 20.3112 11.9485 0.9726 15.7652 6.9775 1.9917 0.3363 3.4400 1.1304 36.8174 16.5736 1.8210 0.1485 0.5610 75.4068 108.2292 25.3772
temp: 298.150 k
press: 1.00000 atm
elementType: 16 8 8 8 8 8 7 7 7 7 6 6 6 6 6 6 6 6 6 6 6 6 6 6 6 6 6 6 6 6 6 6 1 1 1 1 1 1 1 1 1 1 1 1 1 1 1 1 1 1 1 1 1 1 1
symmnumber: 1
zpe: 1111287.0 jmol-1
zpe.correction: 0.423267 hartree
zpe.thermalcorrener: 0.452885 hartree
zpe.thermalcorrenthalpy: 0.453829 hartree
zpe.thermalcorrgfe: 0.356451 hartree
zpe.sumelectzpe: -1842.779457 hartree
zpe.sumelectthermal: -1842.749839 hartree
zpe.sumelectthermalent: -1842.748894 hartree
zpe.sumelectthermalfe: -1842.846273 hartree
dipole: 11.8985 0.1412 3.8660
dipole: 12.5116
quadrupole: -90.9219 -162.8737 -173.9293
quadrupole: 12.8971 35.8591 -1.6975
quadrupole: 51.6531 -20.2988 -31.3543 12.8971 35.8591 -1.6975
hfenergy: -1843.2027234 hartree
pointgroup: C01 [X(C22H23N4O5S1)]
dipole: 4.4575619 0.2406607 2.0742769 debye
polarizability: 387.4014669|58.3548396|262.2723952|36.1962623|12.6284126|298.5086107 unknown
InChI: InChI=1S/C22H23N4O5S/c1-23-20(28)13-6-8-25(9-7-13)12-14-4-5-16-18(21(29)26(16)19(14)22(30)31)24-17(27)11-15-3-2-10-32-15/h2-3,6-10,16,18,23-24,30H,4-5,11-12H2,1H3
charge 1 multiplicity 1
55 atoms
S  -4.922254 3.065868 -1.281807
O  -2.52365 -2.348899 -2.061906
O  0.080704 -1.618371 -2.845983
O  2.177148 -2.27932 -2.127942
O  -3.964583 0.173479 2.346476
O  6.921347 2.580881 -0.689477
N  -0.949235 -1.405674 -0.404158
N  -3.986478 -0.324531 0.089323
N  3.562481 -0.894078 0.621044
N  6.138127 3.530526 1.297906
C  -1.592667 -0.901198 0.862724
C  -2.97315 -1.347949 0.278453
C  -1.014809 -1.638761 2.067859
C  -2.206403 -1.806651 -0.998253
C  0.530135 -1.512978 2.037774
C  0.414334 -1.720465 -0.496526
C  1.169292 -1.768498 0.670781
C  2.650225 -2.116377 0.684879
C  0.995076 -1.922117 -1.867923
C  -4.456003 0.367223 1.190687
C  -5.611446 1.356948 0.942325
C  4.137483 -0.53307 -0.579622
C  3.803361 -0.162185 1.75912
C  -5.870849 1.735656 -0.491064
C  4.962184 0.59424 -0.654276
C  4.61501 0.978198 1.722547
C  5.207549 1.384299 0.497723
C  -6.789704 1.201359 -1.38669
C  6.160969 2.556185 0.325754
C  -6.76436 1.810964 -2.69614
C  -5.825032 2.820638 -2.813455
C  7.029015 4.703746 1.242481
H  -1.500127 0.193359 0.952672
H  -3.375255 -2.215432 0.838224
H  -1.428282 -1.221051 2.999887
H  -1.299183 -2.706826 2.021371
H  0.964672 -2.218109 2.773892
H  0.815702 -0.495619 2.386719
H  -4.400967 -0.15993 -0.833506
H  2.928252 -2.754342 -0.165136
H  2.899826 -2.633686 1.627542
H  -6.520118 0.887992 1.36692
H  -5.407436 2.238359 1.575749
H  3.900282 -1.170039 -1.4353
H  3.34941 -0.527842 2.682068
H  0.441118 -1.802778 -3.755835
H  5.448603 0.867892 -1.594612
H  4.800168 1.502546 2.6639
H  -7.484027 0.402353 -1.110604
H  -7.425539 1.515507 -3.513739
H  -5.596607 3.452547 -3.669797
H  5.447537 3.494628 2.04942
H  7.639399 4.769982 2.159906
H  6.445819 5.634289 1.126803
H  7.693537 4.587212 0.373422
