program: Gaussian 09
title: 000242774
version: EM64L-G09RevD.01
frameworkgroup: C1[X(C8H10N2O4S2)]
method: RPBEPBE
basis: SDD
operation: Freq
keyword: #p
keyword: freq=noraman
keyword: PBEPBE/SDD
title: #p freq=noraman PBEPBE/SDD
converged: YES YES NO NO
title: Mulliken charges:
elementType: S S O O O O N N C C C C C C C C H H H H H H H H H H
charge: 0.927716 0.927736 -0.526989 -0.527281 -0.527561 -0.526710 -0.290787 -0.290795 0.190292 0.190281 -0.262892 -0.205998 -0.262892 -0.205989 -0.724889 -0.724892 0.271991 0.299298 0.271992 0.299290 0.283494 0.282634 0.283410 0.283561 0.283342 0.282634
chargesum: 0.00000
title: Mulliken charges with hydrogens summed into heavy atoms:
elementType: S S O O O O N N C C C C C C C C
charge: 0.927716 0.927736 -0.526989 -0.527281 -0.527561 -0.526710 -0.290787 -0.290795 0.190292 0.190281 0.009099 0.093300 0.009100 0.093301 0.124650 0.124646
polarizability: 3.58318841e+02 5.63894323e-05 1.49666176e+02 3.13197681e-03 1.18476844e-02 1.12070521e+02
1716.lowfreq: -27.2962 -19.7320 -7.7318 -5.3135 -0.0024 -0.0014 -0.0012 2.5169 35.1699
frequency: -26.0252 -19.6774 34.7704 60.2357 62.9396 107.3430 111.5850 156.5985 161.0516 161.5512 171.4322 192.2569 211.5097 230.3476 236.3253 244.8090 301.0142 319.2094 323.9634 335.4834 361.4877 378.7652 418.7340 491.4852 508.7707 547.8604 548.3271 595.9768 606.6574 632.3883 748.7785 757.3128 787.2794 797.2570 812.0282 813.6098 845.8091 893.1555 895.1390 939.9995 942.2871 988.8540 989.3057 990.0564 1024.1960 1024.9347 1111.2647 1205.2599 1263.0776 1315.1633 1315.2587 1322.5383 1374.4183 1391.1000 1413.7104 1413.9165 1415.6802 1415.6931 1446.0744 1505.6927 1583.3166 1630.3925 3040.0853 3040.0969 3155.6082 3160.7522 3174.5125 3184.7690 3188.5355 3188.5505 3196.1020 3196.1117
redmass: 4.5056 7.5245 4.7411 7.8057 8.8301 5.7585 6.9773 4.8028 1.0373 1.0579 5.8052 6.1736 4.4055 4.3294 6.4757 4.2756 5.1087 7.4358 9.0617 8.9695 9.8561 9.2359 4.0514 2.1718 9.2077 10.3436 6.5496 8.7186 9.7687 7.5642 5.3302 1.3684 5.6198 7.6002 12.7305 12.0152 1.7963 3.4175 3.3132 3.2837 1.3698 1.3022 1.2846 1.3105 1.7806 1.7925 1.5622 1.2352 2.0012 1.1448 1.1355 1.9349 1.7960 2.0844 1.0545 1.0523 1.0522 1.0522 8.7433 5.5769 7.7302 6.4118 1.0249 1.0249 1.0885 1.0872 1.0995 1.1006 1.1077 1.1077 1.1075 1.1075
irintensity: 12.3019 0.0025 0.0020 0.9729 0.0063 18.0437 0.3352 0.9142 0.0001 0.0522 10.1343 0.0002 0.2638 1.1513 0.5261 0.0000 0.0020 24.1538 2.8834 71.1690 35.4606 219.4625 0.0000 5.8251 0.4981 13.3468 33.0378 162.0624 0.6869 0.7114 0.0031 0.3410 60.5210 8.0094 0.2006 77.3238 49.8894 0.0027 87.4691 0.1346 0.0032 44.5699 0.0029 38.7104 0.0055 122.4967 22.9400 0.0466 7.3653 4.2223 2.4279 1.0101 26.0200 4.8126 16.1878 8.2080 0.0033 26.5843 1.2103 258.2919 16.0014 0.0661 0.4383 0.1084 0.4398 1.5557 0.4416 4.3538 0.7547 0.2816 0.0883 0.0813
temp: 298.150 k
press: 1.00000 atm
elementType: 16 16 8 8 8 8 7 7 6 6 6 6 6 6 6 6 1 1 1 1 1 1 1 1 1 1
symmnumber: 1
zpe: 457036.7 jmol-1
zpe.correction: 0.174076 hartree
zpe.thermalcorrener: 0.190888 hartree
zpe.thermalcorrenthalpy: 0.191833 hartree
zpe.thermalcorrgfe: 0.129167 hartree
zpe.sumelectzpe: -1515.779249 hartree
zpe.sumelectthermal: -1515.762437 hartree
zpe.sumelectthermalent: -1515.761492 hartree
zpe.sumelectthermalfe: -1515.824158 hartree
dipole: 0.0003 7.1276 -0.0634
dipole: 7.1279
quadrupole: -74.3366 -112.7792 -124.6127
quadrupole: 0.0006 0.2232 -0.0104
quadrupole: 29.5729 -8.8697 -20.7032 0.0006 0.2232 -0.0104
hfenergy: -1515.9533251 hartree
pointgroup: C01 [X(C8H10N2O4S2)]
dipole: -0.0002399 2.8042122 0.0251189 debye
dipolederiv: 2.340386 0.1416376 -0.0009541 0.7673345 1.1184234 -0.000273 -0.0026817 -0.000289 1.2808436 2.3404557 -0.141492 -0.0003819 -0.7672481 1.1183517 0.0004279 0.0034298 -0.0016548 1.2808304 -0.7709162 -0.0418916 -0.0030586 -0.2573805 -0.557369 -0.0434658 -0.152484 -0.1701569 -0.6177733 -0.7705755 -0.041097 0.0030311 -0.257341 -0.558174 0.0441114 0.153756 0.170746 -0.6181135 -0.7703902 0.0404968 -0.0023869 0.2582558 -0.5602276 0.0445547 -0.1539725 0.1717736 -0.6169258 -0.7711731 0.0424335 0.0037398 0.256425 -0.555284 -0.0429955 0.1522862 -0.1690704 -0.6189302 -1.246125 -0.0249463 0.0007279 -0.0997288 -0.2739828 -0.000045 0.0008347 -0.0001457 -0.3785908 -1.2461472 0.0248295 0.0000372 0.0996128 -0.2739667 -0.0000517 -0.0011031 -0.0001475 -0.3785982 0.7337223 0.0629222 -0.0002466 -0.4070459 0.1192694 0.0003265 0.0012009 0.0002265 0.1243161 0.7337177 -0.0628575 -0.0005133 0.4071371 0.1193181 -0.0006814 -0.0009808 0.0000483 0.1243189 -0.216489 -0.1807584 0.0004864 0.0854786 0.0700718 -0.000198 0.0007177 -0.000126 -0.0866623 -0.081251 0.1829984 -0.0001337 0.1801193 -0.0689565 -0.0003277 -0.0000923 -0.0004631 -0.044595 -0.2165209 0.1807312 -0.0000878 -0.0854998 0.0700786 0.0001492 -0.0016033 0.0000386 -0.0866588 -0.0813083 -0.1829952 0.000224 -0.1800744 -0.0690214 -0.0000827 0.0002208 -0.0013416 -0.0446055 -0.178514 0.0372236 0.0000876 0.0274698 -0.1015481 -0.0002739 0.0002299 -0.0001495 -0.1029243 -0.1785175 -0.0372302 -0.0002675 -0.0274634 -0.1015564 -0.0008777 -0.0007542 -0.000412 -0.1029311 0.0589907 0.0982455 -0.0000922 0.0212788 0.0231016 0.0000684 0.0001995 -0.0000048 0.1510054 0.0267771 -0.0504637 0.0001498 0.0183172 0.061349 0.0000717 -0.000681 0.0004667 0.119587 0.0590053 -0.098242 0.000165 -0.0212762 0.0230904 0.0000648 0.0001092 0.0001396 0.1510058 0.0268645 0.0504586 -0.0001439 -0.018365 0.0613655 0.000043 0.0017749 0.0008807 0.1195992 0.0562091 0.0237643 0.0063465 0.0336757 0.0687229 0.0574271 0.0405121 0.0507287 0.0254323 -0.0081962 -0.0370363 0.0002176 -0.0121386 0.0302724 -0.0000013 0.0002817 0.0000182 0.1221437 0.0559838 0.0235609 -0.0063793 0.0334935 0.0688405 -0.0575822 -0.0406106 -0.0508365 0.0253292 0.0563924 -0.0238714 -0.0065228 -0.0336183 0.0680079 0.0575534 -0.0405675 0.0508836 0.0261772 0.0558209 -0.0234555 0.0062256 -0.0335555 0.0695391 -0.0574407 0.0405738 -0.0506601 0.0245822 -0.0082012 0.0370351 -0.0002697 0.0121372 0.030284 -0.0005013 -0.0005961 -0.0004926 0.122138 unknown
polarizability: 358.3186859|0.0115592|149.6661782|-0.1948364|-0.0096537|112.0706743 unknown
InChI: InChI=1S/C8H10N2O4S2/c1-15(11,12)9-7-3-5-8(6-4-7)10-16(2,13)14/h3-6H,1-2H3
charge 0 multiplicity 1
26 atoms
S  -3.81742 -0.751237 0.000057
S  3.8175 -0.750804 -0.007894
O  -3.619508 -1.545759 -1.408896
O  -3.612515 -1.548321 1.406646
O  3.607308 -1.557791 1.392333
O  3.625159 -1.535416 -1.423079
N  -2.771537 0.895836 -0.001762
N  2.771401 0.896128 -0.004143
C  -1.447948 0.74016 -0.00221
C  1.447829 0.740308 -0.003191
C  -0.684166 2.004191 -0.002443
C  -0.684513 -0.524421 0.00067
C  0.683917 2.004261 -0.002721
C  0.684529 -0.524353 0.000285
C  -5.504081 0.117505 0.004979
C  5.503997 0.118092 0.009611
H  -1.261552 2.933384 -0.003121
H  -1.23095 -1.472434 0.003886
H  1.261207 2.933513 -0.00371
H  1.23107 -1.472304 0.004135
H  -5.540613 0.726623 -0.907281
H  -6.249882 -0.689245 0.006206
H  -5.536078 0.725189 0.918366
H  5.543941 0.733474 -0.898288
H  5.532397 0.719483 0.927275
H  6.249909 -0.688557 0.008192
