program: Gaussian 09
title: 000242766
version: EM64L-G09RevD.01
frameworkgroup: C1[X(C18H14N2O2S)]
method: RPBEPBE
basis: SDD
operation: Freq
keyword: #p
keyword: freq=noraman
keyword: PBEPBE/SDD
title: #p freq=noraman PBEPBE/SDD
converged: YES YES NO NO
title: Mulliken charges:
elementType: S O O N N C C C C C C C C C C C C C C C C C C H H H H H H H H H H H H H H
charge: 0.250513 -0.236973 -0.223582 -0.104316 -0.442423 -0.045871 0.097564 0.275851 0.315799 0.188489 -0.238878 -0.343452 -0.378758 -0.359828 -0.373396 -0.125163 -0.244507 -0.225403 -0.503777 -0.229177 -0.220334 -0.232924 -0.223950 0.335479 0.310964 0.287339 0.259778 0.274746 0.238208 0.245231 0.236825 0.232352 0.263907 0.232817 0.236417 0.234225 0.236209
chargesum: 0.00000
title: Mulliken charges with hydrogens summed into heavy atoms:
elementType: S O O N N C C C C C C C C C C C C C C C C C C
charge: 0.250513 -0.236973 -0.223582 -0.104316 -0.106944 -0.045871 0.097564 0.275851 0.315799 0.188489 0.072086 -0.056113 -0.118980 -0.085082 -0.135188 0.120069 -0.007682 0.006949 -0.239870 0.003639 0.016083 0.001301 0.012259
polarizability: 2.86523860e+02 -1.42323227e+01 2.61211678e+02 6.53180845e+00 -1.95260266e+01 1.48110426e+02
1716.lowfreq: -12.8088 -2.3151 0.0011 0.0017 0.0019 4.3945 15.5698 26.4569 29.6694
frequency: 14.3332 25.8924 29.6605 39.0391 46.0803 65.4729 79.7385 101.0571 125.2800 157.4002 184.6539 198.7648 224.0892 243.1329 265.4016 307.6137 349.1501 374.7139 395.0658 401.9828 406.2860 425.9626 475.0143 479.3493 501.5148 518.2938 556.4765 600.6757 612.6219 612.9113 621.2872 648.3375 671.6049 683.4546 690.8405 693.8330 705.5440 709.9477 722.9139 764.5182 785.9464 793.9221 820.9448 834.7591 858.5278 864.6474 868.7072 909.4583 938.9122 944.2391 985.6238 988.7223 990.1419 990.3492 1003.5638 1006.6417 1007.1088 1020.1440 1034.9509 1046.9550 1063.1640 1085.6853 1088.4987 1092.5710 1174.5486 1175.8698 1190.5610 1193.8166 1194.4539 1211.7979 1238.8672 1273.4283 1289.9651 1320.9484 1322.0227 1340.1085 1379.2498 1383.5700 1431.1012 1432.9984 1455.1760 1478.5573 1481.5445 1485.7315 1540.9635 1573.2697 1582.1089 1592.6285 1608.7385 1609.5886 1621.1617 3125.1916 3129.0622 3135.6575 3138.9364 3148.4538 3149.3863 3158.3393 3160.5361 3169.0559 3172.0738 3176.5241 3233.5193 3242.3383 3505.2474
redmass: 5.2281 5.8567 5.0639 5.7982 4.7109 7.1069 5.6978 8.6411 6.1829 5.1259 5.2045 5.9433 6.4796 7.4419 6.0868 7.8848 7.8951 5.6091 5.1021 2.8368 2.9484 6.8345 5.4782 3.7157 2.1255 2.0882 3.0219 9.5272 6.3114 6.4837 6.8722 6.7807 1.2481 5.5907 5.5703 5.4162 1.5543 1.7249 5.5945 6.2045 2.2053 2.3478 4.9158 1.2725 1.3615 1.2500 5.0383 1.3550 1.4301 1.4102 1.6624 4.3173 1.7110 2.7214 4.1528 1.3574 1.4116 2.8886 1.9866 2.0603 2.0463 1.4953 1.4565 1.4053 1.0546 1.0578 1.4552 1.6217 1.2938 2.5675 2.2327 3.6174 6.8599 1.3247 1.3293 2.5773 7.9579 8.7510 2.0831 2.2448 1.6395 2.3978 2.7135 3.7983 5.9371 8.7849 6.1250 7.3153 5.9654 5.9563 8.1459 1.0872 1.0851 1.0877 1.0883 1.0921 1.0929 1.0968 1.0960 1.1017 1.1010 1.0918 1.0953 1.1009 1.0784
irintensity: 0.5058 0.0827 0.1219 2.6147 1.2453 0.7439 0.8515 3.9019 1.2735 3.8678 1.4476 0.9007 1.6416 1.6612 2.8607 5.8984 2.9911 3.6139 1.6872 0.4977 0.5085 4.4563 2.7891 6.1739 39.5374 81.3753 9.5168 7.6501 1.3228 2.0486 40.3384 23.9512 84.2263 8.9997 10.2409 9.1960 122.3036 60.2554 10.7705 14.1210 25.1804 27.0028 4.7245 26.6816 1.0466 2.5619 4.2706 2.6981 1.8522 9.1469 2.6318 0.4357 3.3108 0.1285 39.7710 2.2356 3.2445 22.2247 0.2596 2.8219 62.2613 6.1951 8.1401 6.8748 0.0696 0.6345 15.6318 0.6869 8.1584 27.0725 72.9081 126.5909 456.4909 0.0172 0.8423 6.0379 0.6542 1.0070 2.7122 9.8632 95.3260 2.7437 14.7341 57.5448 39.9504 128.5555 27.1900 68.7565 3.0677 9.5463 103.8780 6.3913 0.0305 2.5009 7.6367 17.9933 9.3085 14.4086 13.7584 27.5596 18.7691 9.8926 4.6666 0.1215 16.9375
temp: 298.150 k
press: 1.00000 atm
elementType: 16 8 8 7 7 6 6 6 6 6 6 6 6 6 6 6 6 6 6 6 6 6 6 1 1 1 1 1 1 1 1 1 1 1 1 1 1
symmnumber: 1
zpe: 723628.2 jmol-1
zpe.correction: 0.275615 hartree
zpe.thermalcorrener: 0.295492 hartree
zpe.thermalcorrenthalpy: 0.296436 hartree
zpe.thermalcorrgfe: 0.223597 hartree
zpe.sumelectzpe: -1350.700275 hartree
zpe.sumelectthermal: -1350.680398 hartree
zpe.sumelectthermalent: -1350.679454 hartree
zpe.sumelectthermalfe: -1350.752293 hartree
dipole: -4.3810 -1.5162 -3.3519
dipole: 5.7208
quadrupole: -124.3197 -129.2036 -141.6573
quadrupole: -6.3332 1.8633 -2.7618
quadrupole: 7.4072 2.5233 -9.9304 -6.3332 1.8633 -2.7618
hfenergy: -1350.9758904 hartree
pointgroup: C01 [X(C18H14N2O2S1)]
dipole: -1.7976676 0.5031164 1.2574192 debye
polarizability: 284.6519518|16.3640651|262.4295389|-1.5736334|-21.7917063|148.7644733 unknown
InChI: InChI=1S/C18H14N2O2S/c21-17(14-8-3-1-4-9-14)19-20(16-12-7-13-23-16)18(22)15-10-5-2-6-11-15/h1-13,19H
charge 0 multiplicity 1
37 atoms
S  2.182898 2.584012 0.504365
O  2.818471 -1.996884 0.231651
O  -0.179519 1.008497 -1.829793
N  1.468279 -0.094473 0.191396
N  0.185406 0.440541 0.406533
C  2.553346 0.831951 0.192328
C  1.654994 -1.508567 0.164635
C  0.433018 -2.380197 0.084803
C  -1.912371 1.539062 -0.197355
C  -0.585017 0.988135 -0.635332
C  3.912946 0.62203 0.002467
C  -0.555246 -2.226164 -0.921524
C  0.361884 -3.482831 0.975564
C  -2.469811 2.592459 -0.966424
C  -2.632417 1.023209 0.913052
C  4.682707 1.839589 0.089157
C  -1.616566 -3.152843 -1.012494
C  -0.711995 -4.394546 0.893342
C  3.93266 2.971277 0.351864
C  -1.70602 -4.23008 -0.10006
C  -3.718626 3.143123 -0.61356
C  -3.885967 1.572999 1.259605
C  -4.427246 2.638149 0.503091
H  -0.108695 0.538786 1.382233
H  4.337312 -0.363892 -0.175211
H  -0.475832 -1.414394 -1.65179
H  1.157531 -3.621792 1.715281
H  -1.9113 2.957595 -1.834371
H  -2.251277 0.163492 1.477104
H  5.76737 1.863844 -0.041984
H  -2.367967 -3.036761 -1.801024
H  -0.766083 -5.2369 1.591539
H  4.247458 4.007239 0.459104
H  -2.534206 -4.943895 -0.172123
H  -4.141215 3.961349 -1.206313
H  -4.444124 1.164062 2.108586
H  -5.399181 3.064315 0.774955
