program: Gaussian 09
title: 000242763
version: EM64L-G09RevD.01
frameworkgroup: C1[X(C16H13NO)]
method: RPBEPBE
basis: SDD
operation: Freq
keyword: #p
keyword: freq=noraman
keyword: PBEPBE/SDD
title: #p freq=noraman PBEPBE/SDD
converged: NO YES NO NO
title: Mulliken charges:
elementType: O N C C C C C C C C C C C C C C C C H H H H H H H H H H H H H
charge: -0.262381 -0.439650 0.066811 0.151412 0.253541 0.182043 0.050224 0.231810 -0.396888 -0.361220 -0.801827 -0.367827 -0.367945 -0.207492 -0.264045 -0.220382 -0.220346 -0.235603 0.319565 0.229532 0.280337 0.247498 0.222301 0.247500 0.250485 0.250508 0.229463 0.232223 0.232989 0.232979 0.234383
chargesum: 0.00000
title: Mulliken charges with hydrogens summed into heavy atoms:
elementType: O N C C C C C C C C C C C C C C C C
charge: -0.262381 -0.120085 0.066811 0.151412 0.253541 0.182043 0.050224 0.231810 -0.167356 -0.080882 -0.084528 -0.117341 -0.117437 0.021970 -0.031822 0.012608 0.012634 -0.001220
polarizability: 2.65694600e+02 -1.42306755e-01 1.74378959e+02 3.48026130e-04 4.24303366e-02 1.15382252e+02
1716.lowfreq: -39.0786 -11.4148 -0.0009 -0.0009 -0.0004 4.0821 4.8031 50.9817 66.5098
frequency: -39.0045 50.9293 66.5088 84.0726 89.6433 133.8111 201.8352 224.9438 249.1596 281.5813 293.4990 320.1207 330.9017 398.6524 420.3529 445.0926 486.6889 500.8339 535.9307 578.0488 597.3839 606.8943 618.2700 660.7644 662.8049 688.7515 695.1991 705.9113 767.1916 772.0735 792.6609 812.7474 858.7492 868.7615 872.1028 930.5516 963.4759 964.5465 981.0203 988.3778 999.2449 1001.3006 1005.9734 1027.3144 1030.5193 1040.9961 1077.7936 1105.7846 1167.9283 1174.3221 1175.9369 1187.4577 1191.7144 1253.7318 1275.0499 1292.2965 1310.8498 1348.7402 1369.3858 1401.8407 1407.9628 1425.2076 1428.5692 1451.4874 1459.4438 1472.1602 1480.1789 1506.8671 1533.3594 1583.0739 1590.7259 1603.7778 1618.6005 1629.9679 2986.9337 3060.0059 3106.2760 3115.5738 3127.1602 3132.2070 3138.5157 3143.1419 3152.3324 3153.0463 3167.5607 3168.0954 3544.4494
redmass: 3.8943 4.5821 4.8566 1.0382 4.5829 4.1340 5.3512 4.7274 4.3496 4.2702 4.1066 4.9840 4.4351 2.8148 5.7933 3.3338 4.0470 8.1423 3.3971 6.8388 1.1493 6.4873 4.2098 6.6130 6.4662 5.4874 3.9921 1.7089 1.6193 2.0018 2.8576 4.5192 1.2420 4.1452 1.5342 1.4471 5.7180 1.3642 1.3861 6.1283 1.3289 1.3252 2.1428 2.0129 1.9165 1.4717 1.6054 1.9244 1.1227 1.0544 3.3881 1.1196 2.1943 2.3877 2.4776 2.1840 1.3661 2.9029 7.1302 1.4636 4.0616 2.3409 2.1752 1.0447 1.1532 2.5914 2.4337 3.5115 8.1404 5.9676 4.4092 6.7553 6.8610 6.1168 1.0371 1.0965 1.0997 1.0884 1.0849 1.0881 1.0883 1.0927 1.0934 1.0969 1.1017 1.1002 1.0775
irintensity: 0.2168 0.0501 0.6058 0.1969 3.7280 0.1392 0.0339 0.4326 0.0806 2.3328 1.5082 10.7019 0.0905 0.1426 6.9624 2.8398 10.4213 0.8690 10.1319 4.1480 51.6951 0.8394 3.2444 6.1236 1.5963 6.2801 7.0198 54.1950 89.0996 47.3733 7.8410 1.5974 0.5824 7.0312 0.0378 4.2237 3.2013 2.2826 0.2726 0.8287 0.5394 0.5159 28.2008 1.8756 5.8526 0.7323 9.1502 20.4622 0.9716 0.0048 24.8155 2.4882 20.3742 17.1485 3.1581 0.9572 0.3848 8.7523 0.1174 52.5453 6.2213 24.0757 8.8958 6.1188 13.3834 45.2622 32.0042 128.6144 181.0071 1.6078 13.7751 77.0206 22.3356 114.6617 20.5483 11.3223 19.5692 6.7978 1.5190 0.0786 10.5956 13.3428 7.6598 28.9455 30.6096 23.6761 49.6886
temp: 298.150 k
press: 1.00000 atm
elementType: 8 7 6 6 6 6 6 6 6 6 6 6 6 6 6 6 6 6 1 1 1 1 1 1 1 1 1 1 1 1 1
symmnumber: 1
zpe: 640754.0 jmol-1
zpe.correction: 0.244050 hartree
zpe.thermalcorrener: 0.257909 hartree
zpe.thermalcorrenthalpy: 0.258853 hartree
zpe.thermalcorrgfe: 0.203120 hartree
zpe.sumelectzpe: -746.269946 hartree
zpe.sumelectthermal: -746.256087 hartree
zpe.sumelectthermalent: -746.255143 hartree
zpe.sumelectthermalfe: -746.310877 hartree
dipole: 3.4846 -5.4422 0.0019
dipole: 6.4623
quadrupole: -90.5745 -110.0005 -101.8262
quadrupole: 8.5153 0.0002 0.0167
quadrupole: 10.2259 -9.2001 -1.0258 8.5153 0.0002 0.0167
hfenergy: -746.5139964 hartree
pointgroup: C01 [X(C16H13N1O1)]
dipole: -1.3483644 -2.1554468 0.0002976 debye
polarizability: 265.6815008|1.1028266|174.3920052|-0.0048291|-0.0702239|115.3823051 unknown
InChI: InChI=1S/C16H13NO/c1-11-15(12-7-3-2-4-8-12)17-14-10-6-5-9-13(14)16(11)18/h2-10,17H,1H3
charge 0 multiplicity 1
31 atoms
O  1.956742 2.794164 -0.000377
N  0.265759 -0.981306 0.000687
C  -0.563408 0.143504 0.00058
C  -0.029163 1.427435 0.000525
C  1.66051 -0.900812 0.000461
C  2.268019 0.391061 0.000377
C  1.434294 1.622705 0.000868
C  -2.032114 -0.166144 0.000473
C  2.46108 -2.077569 0.000185
C  3.686038 0.478221 -0.00007
C  -0.880132 2.675613 0.000368
C  -2.733554 -0.319212 -1.223727
C  -2.732821 -0.323679 1.224533
C  3.859795 -1.961905 -0.000223
C  4.479566 -0.679379 -0.000362
C  -4.114058 -0.622033 -1.223233
C  -4.113337 -0.626474 1.223757
C  -4.806564 -0.777736 0.000189
H  -0.17883 -1.901199 0.000614
H  1.984283 -3.06582 0.000245
H  4.123581 1.48212 -0.000109
H  -0.639687 3.298868 0.881276
H  -1.958303 2.449066 0.000484
H  -0.639834 3.2986 -0.880774
H  -2.198581 -0.187301 -2.171141
H  -2.197315 -0.195171 2.172116
H  4.477123 -2.86709 -0.000461
H  5.571767 -0.602175 -0.000682
H  -4.647211 -0.732157 -2.173957
H  -4.645937 -0.74001 2.17439
H  -5.877309 -1.010083 0.000085
