program: Gaussian 09
title: 000242762
version: EM64L-G09RevD.01
frameworkgroup: C1[X(C15H16O)]
method: RPBEPBE
basis: SDD
operation: Freq
keyword: #pfreq=noraman
keyword: PBEPBE/SDD
title: #p freq=noraman PBEPBE/SDD
converged: YES YES NO NO
title: Mulliken charges:
elementType: O C C C C C C C C C C C C C C C H H H H H H H H H H H H H H H H
charge: -0.209334 0.074050 0.367613 0.194747 0.413966 -0.535043 -0.418417 0.051614 -0.475932 -0.372569 -0.489976 -0.435935 -0.687866 -0.266054 -0.247658 -0.679735 0.218862 0.207871 0.239361 0.238646 0.244914 0.261286 0.236272 0.240672 0.213136 0.214640 0.261868 0.229149 0.230583 0.213534 0.216561 0.249173
chargesum: 0.00000
title: Mulliken charges with hydrogens summed into heavy atoms:
elementType: O C C C C C C C C C C C C C C C
charge: -0.209334 0.074050 0.367613 0.194747 0.413966 -0.108311 -0.179056 0.051614 -0.237286 -0.127655 0.007582 -0.195263 0.001778 -0.036905 -0.017075 -0.000467
polarizability: 2.20011521e+02 1.36568415e+01 1.87235227e+02 2.03015992e+00 1.34236612e+01 9.59840669e+01
1716.lowfreq: -16.4792 -6.8323 -0.0007 -0.0005 0.0004 4.7055 10.0131 59.8998 74.7413
frequency: -11.5828 59.8968 74.7319 82.6768 90.2066 154.7710 177.0865 193.1761 208.6627 212.0447 256.6907 271.6322 306.8594 339.1193 388.2660 423.8320 436.3517 465.6422 521.2883 532.4762 552.0427 587.6254 645.8145 670.1033 704.7170 720.3672 760.7002 782.2066 789.7037 802.6609 823.2267 839.8774 882.4711 891.1046 926.9295 959.7785 978.9890 982.5735 992.6685 1011.6886 1031.8419 1050.6636 1060.4151 1061.9995 1085.7133 1110.9770 1159.4822 1175.2982 1195.8607 1227.0821 1231.1956 1238.5137 1263.2160 1278.6112 1309.7588 1329.1645 1345.4484 1384.6918 1388.8104 1403.7747 1413.3639 1427.2458 1443.1935 1460.8378 1469.7179 1470.7718 1480.0863 1482.4425 1493.4250 1513.4398 1568.0548 1593.3551 1601.3395 1628.3765 2955.2262 2982.5822 2990.5541 2991.8208 3047.6760 3049.5299 3077.6779 3083.9329 3102.3844 3103.8496 3116.7172 3121.7588 3129.4719 3141.6634 3145.3105 3163.1393
redmass: 3.4010 3.6194 3.2570 2.6033 3.7717 1.8039 2.7416 2.8002 2.1842 1.2177 3.4288 2.4861 4.0037 4.2451 4.2167 3.0873 3.7380 3.4706 5.4578 3.2276 3.1150 3.3417 5.0948 4.0948 3.5536 3.5544 1.2825 1.6763 1.2461 2.5312 4.1073 1.4588 1.6850 3.1447 4.1525 1.3520 1.3870 2.4886 1.3412 1.9115 2.2178 1.6918 2.1754 1.9728 1.7815 2.2292 1.3205 1.1327 1.6889 1.7485 1.3760 1.7287 1.4790 1.6870 1.4352 1.7085 3.1596 1.2097 1.2045 3.1094 3.7346 3.5424 1.0990 2.3603 1.0416 1.0533 1.0714 1.0509 1.0974 3.5143 7.5142 8.0242 6.3358 6.5689 1.0687 1.0358 1.0618 1.0365 1.0898 1.0989 1.0999 1.0998 1.1008 1.0996 1.0864 1.0860 1.0881 1.0976 1.0949 1.1005
irintensity: 1.0556 2.1722 2.2370 0.7445 1.3612 0.6236 1.5954 0.0715 0.8936 0.1977 1.4990 0.5359 9.1111 0.0636 1.4879 1.6484 5.0451 5.1645 4.0431 4.6951 2.3415 1.9833 3.4453 4.7170 5.1926 0.6247 48.0087 6.6822 5.8112 3.2543 2.0894 58.6442 11.6126 2.9061 32.0160 2.2970 2.3078 3.6388 0.3296 1.6688 4.9169 1.2283 20.8259 4.1423 4.2677 21.5785 10.1207 3.4676 48.0651 3.6200 1.9377 4.9186 7.5087 1.0880 0.4493 33.9580 6.4301 14.8500 24.0912 2.4541 1.6137 5.1949 26.2134 6.2717 13.2547 11.3449 5.3405 14.0223 10.5937 19.6047 18.1810 73.6314 45.1312 5.1992 11.8992 44.1469 38.9633 32.6576 9.0522 9.1138 53.7303 38.6327 19.5944 18.0459 5.3863 3.4565 1.1693 23.9460 38.2670 29.3526
temp: 298.150 k
press: 1.00000 atm
elementType: 8 6 6 6 6 6 6 6 6 6 6 6 6 6 6 6 1 1 1 1 1 1 1 1 1 1 1 1 1 1 1 1
symmnumber: 1
zpe: 694325.3 jmol-1
zpe.correction: 0.264455 hartree
zpe.thermalcorrener: 0.278647 hartree
zpe.thermalcorrenthalpy: 0.279591 hartree
zpe.thermalcorrgfe: 0.223660 hartree
zpe.sumelectzpe: -655.280544 hartree
zpe.sumelectthermal: -655.266352 hartree
zpe.sumelectthermalent: -655.265408 hartree
zpe.sumelectthermalfe: -655.321339 hartree
dipole: 1.7197 -0.4262 -2.0628
dipole: 2.7192
quadrupole: -90.3618 -84.5705 -100.4684
quadrupole: 2.2010 6.0753 0.5060
quadrupole: 1.4385 7.2297 -8.6682 2.2010 6.0753 0.5060
hfenergy: -655.5449982 hartree
pointgroup: C01 [X(C15H16O1)]
dipole: -0.6746186 -0.1534261 0.8159922 debye
polarizability: 215.4768192|-17.6472472|193.3804945|-4.4405074|-3.2993898|94.3735014 unknown
InChI: InChI=1S/C15H16O/c1-3-11-9-10-12-7-5-6-8-13(12)15(11)14(16)4-2/h5-10H,3-4H2,1-2H3
charge 0 multiplicity 1
32 atoms
O  2.638059 0.799399 -0.950644
C  0.670321 -0.191497 0.065518
C  0.99465 -1.55967 0.19206
C  -0.710931 0.240874 0.0283
C  -1.764181 -0.741387 0.185009
C  2.42312 -2.088389 0.17061
C  -0.071303 -2.509869 0.345211
C  1.783598 0.830043 -0.019896
C  -1.40719 -2.118781 0.353674
C  -1.092149 1.606409 -0.208079
C  1.90713 1.835316 1.133913
C  -3.134927 -0.323265 0.149217
C  2.851014 -2.546035 -1.250825
C  -2.436283 1.985543 -0.244931
C  -3.47039 1.016396 -0.053921
C  2.675041 3.117742 0.761656
H  3.138568 -1.322223 0.518832
H  2.499351 -2.944935 0.86836
H  0.190994 -3.567582 0.468214
H  -2.203517 -2.861594 0.48238
H  -0.31933 2.359872 -0.396308
H  0.911032 2.054707 1.557351
H  2.450949 1.289896 1.937281
H  -3.91928 -1.079547 0.273857
H  2.161516 -3.313179 -1.648672
H  3.869016 -2.976238 -1.22894
H  2.849514 -1.682508 -1.936908
H  -2.703372 3.031234 -0.433078
H  -4.520174 1.327559 -0.083047
H  2.107231 3.724218 0.032669
H  2.858629 3.738012 1.656526
H  3.643193 2.866878 0.297108
