program: Gaussian 09
title: 000242761
version: EM64L-G09RevD.01
frameworkgroup: C1[X(C14H17NO2)]
method: RPBEPBE
basis: SDD
operation: Freq
keyword: #p
keyword: freq=noraman
keyword: PBEPBE/SDD
title: #p freq=noraman PBEPBE/SDD
converged: YES YES NO NO
title: Mulliken charges:
elementType: O O N C C C C C C C C C C C C C C H H H H H H H H H H H H H H H H H
charge: -0.468591 -0.233590 -0.466812 -0.381227 -0.575132 -0.333704 0.573313 0.254439 -0.359305 -0.582318 0.265565 -0.412335 -0.415800 -0.470226 0.271978 -0.694026 0.069384 0.208328 0.208204 0.204704 0.206496 0.188055 0.187346 0.197216 0.196898 0.244769 0.230024 0.240981 0.338744 0.282478 0.210095 0.216995 0.209699 0.387354
chargesum: 0.00000
title: Mulliken charges with hydrogens summed into heavy atoms:
elementType: O O N C C C C C C C C C C C C C C
charge: -0.081237 -0.233590 -0.128068 0.035305 -0.163931 0.041696 0.573313 0.254439 0.034809 -0.337549 0.265565 -0.182311 -0.174819 -0.187747 0.271978 -0.057236 0.069384
polarizability: 2.91600197e+02 -2.06031104e+01 1.55952433e+02 -2.09662931e+01 -1.22259560e+01 1.00673869e+02
1716.lowfreq: -13.6216 -3.9497 0.0005 0.0007 0.0009 4.8253 13.1814 38.7520 44.6121
frequency: 7.5200 38.7130 44.5679 84.5076 86.8697 92.2075 120.3402 132.0137 150.6746 199.9530 238.0317 262.0199 272.5568 302.6076 350.2629 364.0358 396.3573 425.6275 451.0944 521.5090 538.6835 553.8027 593.0144 608.2326 616.5054 651.5226 657.7013 717.9845 724.7242 752.1351 758.8193 767.0526 812.1193 819.3090 837.3273 863.3708 876.9338 894.5346 923.5417 945.2877 960.9370 962.2763 999.3971 1020.9779 1043.6812 1073.7926 1082.4691 1109.0292 1123.1196 1141.6503 1161.0846 1196.0401 1207.2665 1234.9084 1237.7898 1252.7752 1280.4884 1282.5902 1288.3984 1298.3032 1322.4959 1333.1314 1338.8993 1349.5129 1388.1562 1390.0650 1404.6422 1455.7251 1463.3573 1464.5515 1473.5007 1478.2243 1482.8197 1488.7194 1507.6303 1535.5377 1577.4724 1638.8257 1668.5635 2952.3565 2966.1506 2969.5076 2972.6334 2977.6013 2991.7604 3012.6084 3026.3360 3047.6032 3069.3786 3071.9830 3122.2770 3129.1683 3151.3641 3230.3844 3548.6113 3605.2882
redmass: 4.0107 3.5286 2.0663 4.2581 3.9816 4.4551 1.9723 4.2855 3.7704 4.9183 1.1011 4.6465 3.4184 4.0621 5.9280 3.6825 3.8809 3.1213 3.2055 4.4996 1.4321 5.5992 4.4893 2.3554 1.1945 4.1413 5.0163 4.5887 1.0680 1.1720 4.1219 3.6204 2.6467 1.5868 1.3217 1.5918 1.5348 1.9550 4.7019 2.0552 1.4427 1.5990 3.7609 2.9425 3.1890 2.3539 1.3642 2.2614 1.3657 1.4584 1.7551 1.6046 1.6025 1.5029 1.5365 1.3556 1.3721 1.2814 1.1751 1.4475 1.7247 1.7185 2.8975 1.6256 5.5016 1.2155 3.3853 4.4186 1.0804 1.0970 1.0802 1.0426 1.0813 1.0909 3.8623 7.2311 6.0490 7.4645 8.7167 1.0588 1.0589 1.0585 1.0371 1.0594 1.0981 1.1004 1.1033 1.1046 1.1007 1.0993 1.0873 1.0920 1.0969 1.0985 1.0646 1.0809
irintensity: 0.0520 0.3178 0.2967 0.0225 0.4201 0.4955 0.0504 0.2331 0.0428 0.1213 0.0004 0.2975 0.5946 0.2746 8.0972 3.6435 0.0852 1.0688 4.9614 17.4947 120.1292 13.2016 8.4866 82.5016 28.4768 23.8325 9.7337 43.4428 9.7685 0.2817 2.7444 2.4877 10.1074 8.1253 0.4536 66.1724 23.9361 1.3483 92.9533 24.5135 5.2579 7.9342 1.2112 208.0194 0.9295 0.8027 7.1218 36.5735 215.6366 0.7013 2.4416 0.3930 1.1832 11.6471 1.4561 0.6535 18.8259 30.6372 5.9429 10.6426 22.8578 15.3532 25.9842 0.7911 54.8973 11.4995 6.4784 29.5205 0.0367 0.9231 1.4794 12.4996 1.7133 23.8297 0.3457 68.9344 12.6815 66.4936 664.2512 12.8075 16.3646 9.9980 43.9249 112.4611 1.5206 2.7469 7.3010 66.6320 91.0134 53.7353 10.7564 14.2298 20.1545 0.2249 62.6265 94.6346
temp: 298.150 k
press: 1.00000 atm
elementType: 8 8 7 6 6 6 6 6 6 6 6 6 6 6 6 6 6 1 1 1 1 1 1 1 1 1 1 1 1 1 1 1 1 1
symmnumber: 1
zpe: 735810.4 jmol-1
zpe.correction: 0.280255 hartree
zpe.thermalcorrener: 0.296850 hartree
zpe.thermalcorrenthalpy: 0.297794 hartree
zpe.thermalcorrgfe: 0.233198 hartree
zpe.sumelectzpe: -747.669481 hartree
zpe.sumelectthermal: -747.652886 hartree
zpe.sumelectthermalent: -747.651942 hartree
zpe.sumelectthermalfe: -747.716538 hartree
dipole: -2.7849 -1.9130 0.9497
dipole: 3.5096
quadrupole: -110.5262 -90.2652 -105.0484
quadrupole: -11.7002 3.5753 -2.7389
quadrupole: -8.5796 11.6814 -3.1018 -11.7002 3.5753 -2.7389
hfenergy: -747.9497363 hartree
pointgroup: C01 [X(C14H17N1O2)]
dipole: 1.1013139 0.6901843 0.4661855 debye
polarizability: 291.734784|-23.568397|151.6459292|16.4936125|19.5042448|104.8457848 unknown
InChI: InChI=1S/C14H17NO2/c1-2-3-4-5-10-6-7-11-9-13(14(16)17)15-12(11)8-10/h6-9,15-16H,2-5H2,1H3
charge 0 multiplicity 1
34 atoms
O  -4.770506 2.036371 0.369431
O  -5.739774 0.18631 -0.687341
N  -2.309417 0.914344 0.449255
C  3.514073 0.109557 -0.167684
C  2.603455 -0.272706 1.033705
C  4.979406 0.362601 0.25013
C  1.1636 -0.538467 0.621125
C  -1.149517 0.149874 0.380114
C  5.890226 0.753364 -0.936741
C  0.163838 0.434997 0.821323
C  -1.493519 -1.100718 -0.259678
C  0.828733 -1.78431 -0.013623
C  -0.471554 -2.074009 -0.449444
C  -2.897424 -1.051268 -0.567067
C  -3.373115 0.192609 -0.123655
C  7.354091 1.00376 -0.514025
C  -4.722549 0.735789 -0.200576
H  3.102311 1.013834 -0.65935
H  3.477762 -0.699537 -0.924906
H  2.640769 0.544403 1.780512
H  3.028951 -1.172117 1.522694
H  5.011292 1.166574 1.015394
H  5.385897 -0.5476 0.739347
H  5.482879 1.662819 -1.423444
H  5.856419 -0.049508 -1.701151
H  0.407984 1.386119 1.308633
H  1.623208 -2.528437 -0.148571
H  -0.70118 -3.033999 -0.924258
H  -2.416754 1.848659 0.840609
H  -3.506121 -1.812951 -1.050222
H  7.793616 0.099265 -0.052544
H  7.983999 1.281686 -1.378982
H  7.417984 1.822366 0.227627
H  -5.700264 2.379723 0.302859
