program: Gaussian 09
title: 000242760
version: EM64L-G09RevD.01
frameworkgroup: C1[X(C14H14OS)]
method: RPBEPBE
basis: SDD
operation: Freq
keyword: #p
keyword: freq=noraman
keyword: PBEPBE/SDD
title: #p freq=noraman PBEPBE/SDD
converged: YES YES NO NO
title: Mulliken charges:
elementType: S O C C C C C C C C C C C C C C H H H H H H H H H H H H H H
charge: 0.321679 -0.197963 0.084919 0.343266 0.343127 0.485087 -0.620217 -0.620462 0.087948 -0.837477 -0.837892 -0.815828 -0.239645 -0.254516 -0.137126 -0.514766 0.239846 0.239808 0.228596 0.236310 0.256839 0.255861 0.228700 0.237322 0.233504 0.226031 0.226085 0.278968 0.251609 0.270384
chargesum: 0.00000
title: Mulliken charges with hydrogens summed into heavy atoms:
elementType: S O C C C C C C C C C C C C C C
charge: 0.321679 -0.197963 0.084919 0.343266 0.343127 0.485087 -0.380371 -0.380654 0.087948 -0.115732 -0.116009 -0.130208 -0.239645 0.024453 0.114484 -0.244382
polarizability: 2.28295441e+02 -1.04746372e-01 1.36668200e+02 4.61836612e+00 -9.87592046e-01 1.42370054e+02
1716.lowfreq: -26.7168 -17.8259 -10.8568 -8.5291 -0.0019 -0.0013 -0.0011 9.6675 45.1278
frequency: -26.5504 -15.7819 45.1205 49.6821 92.4635 94.5303 122.4060 123.5889 179.6854 190.9195 201.6481 225.4806 243.9618 266.5406 316.5848 385.0396 431.5377 477.3085 479.5139 512.8453 520.0649 540.9485 563.6668 565.0733 601.6087 649.7657 684.8596 726.1342 737.2937 747.8967 803.5485 847.7814 854.7836 864.1504 893.5906 926.6463 936.2758 951.9036 1015.7725 1016.8956 1041.0336 1041.9145 1045.4862 1046.2149 1050.7942 1082.7565 1115.6597 1182.1497 1216.9681 1251.2516 1273.1127 1316.9569 1339.9565 1357.6702 1396.1182 1398.2298 1400.5872 1413.2933 1442.8559 1450.5778 1468.1342 1468.9338 1472.9426 1473.5921 1481.7993 1492.4086 1524.3743 1544.7563 1579.8579 1617.9896 2974.5141 2978.6488 2979.3000 3055.8266 3057.4646 3057.7339 3085.1057 3087.8762 3088.2852 3114.1257 3118.3213 3172.3763 3189.3909 3231.5606
redmass: 1.0152 4.8974 4.2216 6.0442 1.1584 1.0471 2.9049 6.3007 3.1220 4.6607 6.4070 2.8278 4.4513 2.5150 3.4734 6.2490 4.6243 3.2387 6.3567 3.3811 4.6333 4.6219 4.1808 3.1113 4.4588 5.2223 7.4356 1.1834 6.0644 4.1892 5.0376 5.0999 1.3243 1.3471 1.3161 1.4718 2.1331 3.4132 1.5887 1.6701 1.7615 1.6786 1.6171 1.5202 1.6215 1.4093 2.4496 1.5789 1.4841 1.4189 4.3230 6.3852 2.4083 7.2186 1.2273 1.3458 1.2480 2.3158 2.1067 6.4463 1.0589 1.0470 1.0866 1.0601 1.1531 1.4195 6.1038 9.8903 7.1446 5.9441 1.0388 1.0373 1.0373 1.0948 1.0970 1.0971 1.0998 1.0994 1.0992 1.0909 1.0919 1.0901 1.0974 1.1002
irintensity: 0.3130 1.7467 0.5685 0.0129 1.8614 0.0237 0.3424 0.7864 2.7853 1.2819 1.8521 0.0077 7.8322 0.3362 0.1972 1.8406 0.8254 2.3840 0.5488 0.0817 0.0019 9.5727 0.2472 0.5219 10.0627 0.6441 0.3481 99.9961 2.7766 24.4579 57.0609 24.6117 6.3690 18.3430 0.0118 0.0388 0.5643 1.8750 2.0557 9.7031 1.4106 14.7166 22.3795 0.2572 28.9435 2.5984 3.0409 5.6749 12.2623 0.0914 137.6546 8.1310 6.5155 0.1705 13.9302 21.4413 4.1995 1.1972 38.4113 88.2279 30.8262 2.7340 9.2146 12.9897 27.9529 14.7848 19.6749 155.7142 16.5402 41.1106 41.0414 36.7243 7.2040 19.9580 5.1482 25.9147 14.8428 19.3596 23.7156 27.4395 15.7614 4.4631 2.5613 0.6994
temp: 298.150 k
press: 1.00000 atm
elementType: 16 8 6 6 6 6 6 6 6 6 6 6 6 6 6 6 1 1 1 1 1 1 1 1 1 1 1 1 1 1
symmnumber: 1
zpe: 616474.1 jmol-1
zpe.correction: 0.234803 hartree
zpe.thermalcorrener: 0.249491 hartree
zpe.thermalcorrenthalpy: 0.250436 hartree
zpe.thermalcorrgfe: 0.192547 hartree
zpe.sumelectzpe: -1014.026093 hartree
zpe.sumelectthermal: -1014.011404 hartree
zpe.sumelectthermalent: -1014.010460 hartree
zpe.sumelectthermalfe: -1014.068349 hartree
dipole: 0.3245 -0.2252 4.2941
dipole: 4.3122
quadrupole: -86.9986 -96.8861 -106.9808
quadrupole: 0.3124 -5.2284 0.4300
quadrupole: 9.9566 0.0691 -10.0257 0.3124 -5.2284 0.4300
hfenergy: -1014.2608959 hartree
pointgroup: C01 [X(C14H14O1S1)]
dipole: -0.0476625 -0.0312381 -1.6956122 debye
polarizability: 227.6674381|-0.221193|136.6083239|8.6514919|0.7764151|143.0579337 unknown
InChI: InChI=1S/C14H14OS/c1-9-7-10(2)13(11(3)8-9)14(15)12-5-4-6-16-12/h4-8H,1-3H3
charge 0 multiplicity 1
30 atoms
S  3.680522 0.009039 0.731414
O  1.053872 0.045499 2.335476
C  -0.545408 0.010579 0.496074
C  -1.207924 1.245328 0.24381
C  -1.199218 -1.231426 0.257231
C  -3.196576 -0.004277 -0.53473
C  -2.525792 1.214905 -0.271051
C  -2.517515 -1.215788 -0.257418
C  0.854199 0.019929 1.079983
C  -0.52659 2.57158 0.539816
C  -0.509923 -2.549866 0.569572
C  -4.600897 -0.012269 -1.113486
C  1.969671 0.000768 0.122495
C  1.937387 -0.023768 -1.27534
C  3.23641 -0.036533 -1.884126
C  4.270683 -0.021797 -0.95329
H  -3.040857 2.164648 -0.463435
H  -3.02624 -2.171152 -0.438504
H  -1.180324 3.420802 0.279253
H  0.417047 2.682455 -0.027379
H  -0.268007 2.654079 1.611521
H  -0.255526 -2.619819 1.643265
H  -1.156824 -3.406193 0.315277
H  0.436889 -2.66026 0.007786
H  -4.575757 -0.016442 -2.220799
H  -5.164673 -0.906834 -0.79545
H  -5.171928 0.880177 -0.802454
H  0.996455 -0.031847 -1.831347
H  3.404005 -0.055662 -2.963378
H  5.34434 -0.026657 -1.137186
