program: Gaussian 09
title: 000242757
version: EM64L-G09RevD.01
frameworkgroup: C1[X(C13H10BrNO3)]
method: RPBEPBE
basis: SDD
operation: Freq
keyword: #p
keyword: freq=noraman
keyword: PBEPBE/SDD
title: #p freq=noraman PBEPBE/SDD
converged: NO YES NO NO
title: Mulliken charges:
elementType: Br O O O N C C C C C C C C C C C C C H H H H H H H H H H
charge: 0.010815 -0.294137 -0.209030 -0.206840 0.026909 0.389855 -0.389115 -0.339217 -0.377811 0.376813 0.398962 -0.362136 -0.344188 -0.331141 -0.372281 -0.175067 -0.151365 -0.233528 0.232554 0.232457 0.239854 0.285169 0.287874 0.287536 0.254467 0.257542 0.250498 0.254554
chargesum: 0.00000
title: Mulliken charges with hydrogens summed into heavy atoms:
elementType: Br O O O N C C C C C C C C C C C C C
charge: 0.010815 -0.294137 -0.209030 -0.206840 0.026909 0.389855 0.075896 -0.099363 -0.092643 0.376813 0.398962 -0.074262 -0.056653 -0.076674 -0.114739 0.075432 0.103188 -0.233528
polarizability: 3.14959178e+02 2.87898653e+00 1.66316937e+02 1.21305018e-01 -5.95390922e-02 6.68357944e+01
1716.lowfreq: -1.5616 0.0005 0.0005 0.0006 1.6968 14.7415 19.0079 22.5628 43.0624
frequency: 18.7458 22.2592 43.0408 66.4765 69.9645 124.3649 126.7196 139.5003 172.2472 229.3845 278.2185 291.8508 313.3990 319.3625 408.5391 412.5836 415.2195 462.2267 472.9700 501.2444 511.1017 598.2979 620.0133 628.1192 656.1063 666.8551 697.7314 719.4537 763.5279 801.1478 803.0175 825.0461 832.0759 842.1351 863.4852 933.2271 958.1031 982.9770 988.1466 1000.5928 1002.1505 1008.9199 1022.0743 1061.1470 1093.0463 1111.4824 1112.9939 1178.2828 1179.6962 1210.7465 1217.8393 1218.2522 1229.4517 1292.7353 1295.0684 1343.1570 1365.6026 1374.7529 1401.2806 1408.4763 1422.4623 1460.6527 1476.4949 1485.3403 1581.5859 1600.1021 1602.6835 1615.2726 2937.6195 2988.0549 3132.0159 3156.4254 3159.9261 3175.4033 3176.5969 3180.5370 3185.2407 3194.8853
redmass: 10.1062 4.2906 9.2693 7.5774 7.2692 9.1013 11.4588 2.8827 10.7625 6.8342 4.2935 7.4634 6.7846 6.7978 2.9056 2.9779 7.9866 5.4621 3.0521 2.7303 6.5365 7.7902 7.1495 7.1357 7.1679 4.9237 3.4890 3.4691 7.2386 7.0841 1.3043 1.5289 5.0847 1.4166 1.3011 1.3429 1.3491 1.3383 4.6180 6.7787 1.3975 3.2521 1.6772 2.4408 3.2626 1.3071 1.3160 1.2509 1.2683 2.4063 3.6655 1.1475 4.8105 1.2534 1.3086 2.2732 6.2278 3.8805 3.7207 5.9730 2.9106 1.3816 1.7020 2.3485 7.2704 7.4773 6.8512 6.1846 1.0553 1.1045 1.0908 1.0879 1.0886 1.0966 1.0891 1.0977 1.0946 1.0965
irintensity: 0.4020 0.8933 1.4836 1.5432 0.7075 2.0272 0.5876 3.0142 1.3097 0.7700 8.0628 0.2313 0.9456 4.6091 0.0372 0.0017 0.0136 0.3781 10.4545 26.9747 1.4781 39.5059 1.0341 0.2977 4.3150 18.3147 0.0109 12.7003 26.1669 9.6558 11.6947 62.5716 0.6025 51.4184 23.2727 0.3807 0.1366 4.2861 52.1023 98.4147 0.4092 5.0098 1.4530 29.0180 18.0894 22.7535 2.5877 129.9428 4.9525 101.1472 519.9863 51.2469 44.3507 0.1383 6.8047 15.1478 91.2004 23.7526 3.0778 9.4740 56.8059 219.2997 56.7007 16.9011 20.5728 8.5363 23.4687 54.5604 26.9195 22.9041 10.2618 11.6402 2.1870 8.2557 1.2499 1.3649 1.9175 0.5708
temp: 298.150 k
press: 1.00000 atm
elementType: 35 8 8 8 7 6 6 6 6 6 6 6 6 6 6 6 6 6 1 1 1 1 1 1 1 1 1 1
symmnumber: 1
zpe: 527780.0 jmol-1
zpe.correction: 0.201021 hartree
zpe.thermalcorrener: 0.216821 hartree
zpe.thermalcorrenthalpy: 0.217765 hartree
zpe.thermalcorrgfe: 0.153961 hartree
zpe.sumelectzpe: -793.899204 hartree
zpe.sumelectthermal: -793.883404 hartree
zpe.sumelectthermalent: -793.882460 hartree
zpe.sumelectthermalfe: -793.946264 hartree
dipole: 3.4677 2.4494 0.0201
dipole: 4.2456
quadrupole: -177.0155 -100.4253 -116.9972
quadrupole: -8.4959 -0.0780 0.0619
quadrupole: -45.5362 31.0540 14.4822 -8.4959 -0.0780 0.0619
hfenergy: -794.1002245 hartree
pointgroup: C01 [X(C13H10Br1N1O3)]
dipole: -1.3771973 0.6216708 0.7119638 debye
polarizability: 314.8741598|3.7069178|112.4570243|-4.5513513|49.4723655|120.780725 unknown
InChI: InChI=1S/C13H10BrNO3/c14-11-3-7-13(8-4-11)18-9-10-1-5-12(6-2-10)15(16)17/h1-8H,9H2
charge 0 multiplicity 1
28 atoms
Br -7.29429 -0.314269 0.027876
O  -1.123049 -0.294479 -0.182543
O  6.164052 0.480099 0.434341
O  5.69187 -1.024397 -1.215299
N  5.334081 -0.196536 -0.289973
C  1.139316 0.338536 0.424722
C  -0.335465 0.556395 0.708807
C  2.094219 1.058877 1.189209
C  1.580378 -0.559053 -0.577193
C  3.883297 -0.011182 -0.04286
C  -2.52342 -0.235974 -0.069251
C  3.47206 0.890879 0.963144
C  2.957326 -0.739771 -0.818003
C  -3.221146 0.593113 0.842334
C  -3.235399 -1.085258 -0.950279
C  -4.635376 0.567603 0.868098
C  -4.642902 -1.110666 -0.924434
C  -5.331759 -0.280932 -0.011966
H  -0.562004 0.305455 1.767254
H  -0.602792 1.62257 0.545774
H  1.760282 1.755881 1.967169
H  0.83717 -1.108195 -1.159044
H  4.224551 1.434357 1.539795
H  3.322148 -1.426564 -1.586006
H  -2.696035 1.258492 1.53323
H  -2.677262 -1.717807 -1.646595
H  -5.178198 1.20606 1.570591
H  -5.192454 -1.766937 -1.604698
