program: Gaussian 09
title: 000242754
version: EM64L-G09RevD.01
frameworkgroup: C1[X(C8H14O2)]
method: RPBEPBE
basis: SDD
operation: Freq
keyword: #pfreq=noraman
keyword: PBEPBE/SDD
title: #p freq=noraman PBEPBE/SDD
converged: NO YES NO NO
title: Mulliken charges:
elementType: O O C C C C C C C C H H H H H H H H H H H H H H
charge: -0.298204 -0.237289 -0.167317 -0.225271 -0.685416 -0.684809 0.316089 -0.813245 0.266899 -0.756362 0.216031 0.299785 0.212133 0.213466 0.222461 0.212245 0.222076 0.213714 0.237190 0.237473 0.249588 0.253829 0.247579 0.247355
chargesum: 0.00000
title: Mulliken charges with hydrogens summed into heavy atoms:
elementType: O O C C C C C C C C
charge: -0.298204 -0.237289 0.048714 0.074514 -0.037356 -0.036774 0.316089 -0.088994 0.266899 -0.007599
polarizability: 1.26609651e+02 3.22665640e+00 9.31854622e+01 -4.34379696e-02 -1.08706561e-01 7.01812212e+01
1716.lowfreq: -109.0860 -81.1311 -12.3253 -6.2614 -0.0008 -0.0007 -0.0007 8.3802 27.1292
frequency: -109.0615 -81.0616 26.9609 45.1935 74.2977 121.1747 173.3640 210.5048 216.5355 245.2657 274.3218 349.0608 388.9411 432.1369 438.3603 494.9735 503.9707 572.2620 645.2950 751.3515 838.9782 887.9065 900.4982 916.2426 953.0369 955.3522 1000.2972 1006.6131 1036.6423 1044.5178 1094.3226 1107.3154 1163.1251 1176.4960 1198.4253 1299.2542 1304.5335 1355.6538 1372.8762 1381.6361 1392.2391 1398.0114 1453.4817 1457.2894 1464.7074 1467.1362 1467.5833 1473.8026 1478.1712 1486.2104 1637.4815 1663.5858 2971.4381 2974.3455 2990.6586 2999.4457 3006.8973 3065.7608 3071.6063 3073.4562 3076.3290 3081.5918 3093.7988 3111.3533 3141.4325 3160.7295
redmass: 1.0242 1.0363 3.4308 3.5446 3.0410 3.6750 4.0520 1.1072 2.2223 1.2069 2.8429 3.7360 2.5527 2.7811 3.7874 2.4671 3.2287 3.4837 4.9019 3.9924 2.5501 3.8662 1.3241 1.1784 1.4792 2.0921 1.7819 1.8204 1.4296 1.5915 2.0085 2.5534 2.9866 2.0945 2.5047 1.4167 1.3260 1.5411 1.1950 1.2190 1.2118 1.2743 1.0614 1.0461 1.0441 1.0544 1.0520 1.0451 1.0476 1.0561 10.2263 8.3150 1.0347 1.0350 1.0408 1.0804 1.0364 1.1003 1.0987 1.0994 1.1004 1.0995 1.0972 1.0980 1.1010 1.0907
irintensity: 0.0527 1.0393 1.8705 1.1939 1.6091 1.1429 1.1968 0.3364 2.6231 0.1361 2.8564 4.4943 0.2664 3.8441 0.2657 4.0384 3.6435 1.2656 6.5475 8.8458 1.6103 17.4552 28.8717 5.6501 1.5867 39.1507 64.2781 12.3671 3.5889 7.4186 87.2047 5.9398 376.5058 9.8254 84.5710 11.4662 1.4341 17.0572 15.4560 45.7029 5.6429 27.2868 13.2904 14.4949 3.8449 18.6572 2.7123 23.0150 12.6447 15.6880 155.7190 37.8701 33.7569 39.3732 7.5220 23.5751 5.2492 0.1404 15.6524 92.1717 30.4738 51.2022 7.8278 12.8169 9.3231 0.4448
temp: 298.150 k
press: 1.00000 atm
elementType: 8 8 6 6 6 6 6 6 6 6 1 1 1 1 1 1 1 1 1 1 1 1 1 1
symmnumber: 1
zpe: 530042.8 jmol-1
zpe.correction: 0.201883 hartree
zpe.thermalcorrener: 0.213315 hartree
zpe.thermalcorrenthalpy: 0.214259 hartree
zpe.thermalcorrgfe: 0.163400 hartree
zpe.sumelectzpe: -462.881834 hartree
zpe.sumelectthermal: -462.870402 hartree
zpe.sumelectthermalent: -462.869457 hartree
zpe.sumelectthermalfe: -462.920316 hartree
dipole: 0.0116 2.0836 -0.0050
dipole: 2.0836
quadrupole: -52.0866 -64.2079 -62.0970
quadrupole: 1.1343 0.0398 -0.0659
quadrupole: 7.3772 -4.7440 -2.6332 1.1343 0.0398 -0.0659
hfenergy: -463.0837165 hartree
pointgroup: C01 [X(C8H14O2)]
dipole: -0.0255617 0.7486707 0.3329129 debye
dipolederiv: -1.5131984 -0.2854438 -0.2562764 -0.7577517 -0.7994883 -0.360622 -0.4751256 -0.3183694 -0.3463323 -0.560795 0.2026341 0.06645 -0.2902159 -0.8334571 -0.2587868 -0.1526776 -0.2101214 -0.4249706 0.1494551 -0.0183143 -0.0051877 0.1042414 0.1329825 0.0164948 0.0574545 0.0024018 0.1291839 -0.0876991 -0.0565054 -0.0095222 0.0495395 -0.2394625 0.0190924 0.036917 0.0111701 -0.2614433 -0.0434211 0.0601315 -0.0194351 -0.0367995 0.0445373 0.0545736 0.0106592 0.0659962 0.0052772 -0.0483179 0.028078 0.0594992 -0.0114257 0.0783354 0.0330745 -0.0381612 0.0347343 -0.0259039 0.9699586 0.1741448 0.1747348 0.1159947 0.4497306 0.2334688 0.150944 0.2422639 0.0941075 -0.0362437 -0.0666117 -0.0429104 -0.0405777 -0.1303837 -0.1053484 -0.0298452 -0.110284 0.0385052 1.4098195 0.0029973 0.1158848 0.9016796 1.2445098 0.5446259 0.5193479 0.4591987 0.4701676 -0.4618986 0.0268339 -0.0339206 -0.0569627 -0.0038335 -0.0137298 -0.0693193 -0.0058159 0.0065408 0.0327724 -0.0132484 -0.0049188 -0.0511928 -0.1379745 -0.0811082 -0.0235174 -0.0769013 -0.0213752 0.1159428 0.0225996 0.0046575 -0.0190459 0.0370183 -0.0664851 -0.0159803 -0.0623019 0.1460897 -0.2319954 0.019884 -0.0649543 0.005037 0.0569651 0.0119141 -0.0551264 0.0213799 0.0827801 0.0912302 -0.0557595 -0.0338275 -0.0177994 -0.1105641 -0.0523369 -0.0180581 -0.1220548 0.0314485 0.0634728 -0.0035552 0.1184105 0.0033052 0.0742019 -0.0017489 0.0885378 0.0254506 -0.1377107 -0.2445305 -0.0115268 0.0100726 -0.0157208 0.0930841 -0.0103995 -0.006639 -0.019111 0.057883 0.088923 0.0663659 -0.0507192 0.0429063 -0.0551759 0.1334413 -0.0293282 0.1070024 -0.0346341 0.0888994 -0.0660922 -0.0220499 -0.0198515 -0.1013146 -0.1265157 0.0020614 -0.0640547 0.0253689 0.0167388 -0.1172369 0.0676885 -0.0585759 0.0006263 0.0179519 0.0779494 0.0633684 0.0111557 0.0556591 -0.0208953 -0.113843 0.0174345 0.0461841 0.0355124 -0.0798823 -0.019765 -0.0742199 -0.046212 0.1289552 0.0402666 0.0878194 0.0710575 -0.0152357 0.0212813 -0.0101493 0.1216572 0.0937822 0.0178363 0.0047743 0.0755789 -0.045671 -0.0689982 0.030482 -0.0746923 0.0957286 0.0378671 -0.0393177 0.0299674 -0.055638 0.0052485 0.0872178 0.0744818 0.0748791 0.0752794 0.0597908 0.0040467 -0.0348412 0.0280208 0.122844 -0.0260524 -0.0764556 -0.0142242 -0.064583 unknown
polarizability: 126.3608413|-4.0728117|89.3978514|3.3221446|8.2838001|74.2176419 unknown
InChI: InChI=1S/C8H14O2/c1-6(2)5-7(3)10-8(4)9/h5-6H,1-4H3
charge 0 multiplicity 1
24 atoms
O  -1.535306 0.595789 0.065963
O  -1.646787 -1.550925 -0.905697
C  2.304589 -0.075555 0.129055
C  0.808949 -0.229756 -0.086871
C  2.831442 -1.207511 1.053054
C  3.047663 -0.096888 -1.234879
C  -0.105517 0.71474 0.260288
C  0.168868 2.059029 0.906486
C  -2.201472 -0.508272 -0.494916
C  -3.693994 -0.244393 -0.519983
H  2.515399 0.894356 0.62005
H  0.474638 -1.162618 -0.551101
H  3.921909 -1.108315 1.210627
H  2.640846 -2.198963 0.60078
H  2.333214 -1.184089 2.038814
H  4.139055 0.008727 -1.087873
H  2.703637 0.722255 -1.891568
H  2.865541 -1.05248 -1.761798
H  0.829496 2.683663 0.279008
H  0.652168 1.944915 1.89333
H  -0.780382 2.598946 1.049837
H  -3.935914 0.743428 -0.103715
H  -4.212041 -1.030176 0.057178
H  -4.057103 -0.310708 -1.560467
