program: Gaussian 09
title: 000242749
version: EM64L-G09RevD.01
frameworkgroup: C1[X(C11H14FNO2)]
method: RPBEPBE
basis: SDD
operation: Freq
keyword: #p
keyword: freq=noraman
keyword: PBEPBE/SDD
title: #p freq=noraman PBEPBE/SDD
converged: YES YES NO NO
title: Mulliken charges:
elementType: F O O N C C C C C C C C C C C H H H H H H H H H H H H H H
charge: -0.212104 -0.325636 -0.276513 -0.468197 0.049469 0.307744 0.318648 -0.680996 -0.685073 -0.310873 -0.544842 -0.840694 0.257690 -0.392689 0.335357 0.234597 0.212965 0.254819 0.217285 0.210463 0.232440 0.221113 0.351622 0.304463 0.257778 0.247844 0.234327 0.233813 0.255181
chargesum: 0.00000
title: Mulliken charges with hydrogens summed into heavy atoms:
elementType: F O O N C C C C C C C C C C C
charge: -0.212104 -0.325636 -0.276513 -0.116575 0.284066 0.307744 0.318648 0.004074 -0.021058 -0.006410 -0.287065 -0.124710 0.257690 -0.137508 0.335357
polarizability: 2.03092869e+02 -1.67017633e+00 1.35856312e+02 1.48694198e+00 3.40210812e+00 7.69418148e+01
1716.lowfreq: -10.3755 -2.1813 -0.0007 0.0003 0.0007 8.0831 29.7045 39.5346 72.6749
frequency: 29.3967 39.5315 72.6657 81.7734 90.6181 165.0938 184.4048 190.1075 196.0991 215.6928 220.2579 240.5943 290.7378 314.1093 362.9499 376.9740 392.3427 445.8813 446.6877 465.6220 519.9015 535.6689 561.9209 632.6329 697.6470 699.5299 710.4922 719.2366 753.4956 830.4756 852.0016 864.0081 899.1147 924.9865 931.4826 941.4986 966.2598 987.6875 993.7109 1041.3228 1102.9765 1105.8570 1153.3281 1155.2246 1162.4307 1186.7481 1200.3451 1273.2050 1295.8348 1324.4659 1338.5564 1378.2851 1379.6391 1397.5198 1400.2905 1420.2348 1455.1931 1457.7960 1464.6922 1472.7838 1479.9620 1486.9042 1495.3008 1521.7016 1605.0637 1625.3459 1657.2711 2960.4300 2989.5438 2993.8999 3027.2809 3030.5289 3084.5946 3094.1345 3094.5535 3099.3851 3105.1686 3162.5650 3171.7333 3192.2762 3552.2492
redmass: 3.1265 4.4345 5.8876 4.4510 5.1215 2.5112 1.6817 1.1268 2.3266 2.3573 3.3493 1.3324 3.7746 8.3966 3.2614 5.6102 3.5278 2.7714 3.0768 3.6863 5.1159 5.7163 2.9943 1.2735 6.8941 6.6849 6.5610 3.9271 4.0698 1.3508 3.8374 1.4200 2.9954 1.2302 4.2996 1.3636 1.3062 6.1891 1.6272 1.5107 1.8282 1.6659 1.6528 2.1855 2.7003 1.9904 2.2134 1.4920 2.9324 1.4337 1.3032 5.5209 1.2637 1.2345 1.2947 3.7606 1.5184 1.1348 1.0530 1.0533 1.0447 1.0486 1.4835 2.3037 6.5000 6.5729 7.9558 1.0400 1.0356 1.0359 1.0866 1.0979 1.0993 1.0953 1.0985 1.1006 1.1007 1.0926 1.0902 1.0962 1.0755
irintensity: 0.0124 0.2850 5.3354 0.2629 1.9925 0.1416 1.4328 0.5771 5.7683 0.3087 0.9592 2.1847 5.8250 4.0877 0.9067 2.7239 11.9510 1.7930 8.3274 4.6920 9.5021 1.6288 13.2461 44.5651 31.5494 31.5205 1.2419 10.7703 6.9162 37.1283 0.5007 41.9394 3.9848 2.7063 6.5962 1.0568 2.3285 303.3154 4.1477 7.5913 251.2294 17.5015 11.4975 69.9436 349.3487 10.5699 12.3696 30.4432 4.3785 12.4290 12.8446 65.9230 36.6314 25.5991 20.7054 54.4505 98.9577 20.3489 2.3545 4.5083 15.3102 18.8410 69.6800 594.9181 18.7638 12.4649 223.2940 26.5005 15.9912 25.0788 6.5618 19.6254 7.1241 31.7400 41.3108 21.1345 30.8776 4.1713 1.8202 7.4857 35.7140
temp: 298.150 k
press: 1.00000 atm
elementType: 9 8 8 7 6 6 6 6 6 6 6 6 6 6 6 1 1 1 1 1 1 1 1 1 1 1 1 1 1
symmnumber: 1
zpe: 606745.4 jmol-1
zpe.correction: 0.231097 hartree
zpe.thermalcorrener: 0.246592 hartree
zpe.thermalcorrenthalpy: 0.247536 hartree
zpe.thermalcorrgfe: 0.187568 hartree
zpe.sumelectzpe: -731.514317 hartree
zpe.sumelectthermal: -731.498822 hartree
zpe.sumelectthermalent: -731.497878 hartree
zpe.sumelectthermalfe: -731.557847 hartree
dipole: -3.2936 3.1282 0.3553
dipole: 4.5563
quadrupole: -89.8009 -83.4667 -90.1580
quadrupole: 3.9166 0.1670 0.3210
quadrupole: -1.9924 4.3418 -2.3495 3.9166 0.1670 0.3210
hfenergy: -731.7454143 hartree
pointgroup: C01 [X(C11H14F1N1O2)]
dipole: -1.2983543 -1.2224015 -0.1827855 debye
polarizability: 202.8133601|0.8988254|135.9870237|6.3734172|1.6270839|77.0906125 unknown
InChI: InChI=1S/C11H14FNO2/c1-7(2)15-11(14)13-10-5-4-9(12)6-8(10)3/h4-7,13H,1-3H3
charge 0 multiplicity 1
29 atoms
F  5.043056 0.693592 0.233424
O  -2.697656 -0.467008 -0.099801
O  -1.53915 1.582335 0.079084
N  -0.445374 -0.523063 -0.033131
C  -4.008018 0.274139 -0.136156
C  0.933032 -0.178672 0.039279
C  1.883085 -1.249197 0.004793
C  -4.268786 0.762937 -1.568045
C  -5.046639 -0.723228 0.381327
C  1.367475 1.169187 0.139107
C  3.258901 -0.933686 0.071014
C  1.434531 -2.696776 -0.101398
C  -1.540345 0.328007 -0.011006
C  2.744122 1.468325 0.204546
C  3.66091 0.408244 0.168644
H  -3.905647 1.139319 0.545169
H  -5.239892 1.289083 -1.615305
H  -3.481938 1.465688 -1.889025
H  -4.3013 -0.089658 -2.269423
H  -6.041641 -0.244018 0.414651
H  -4.789976 -1.066433 1.397946
H  -5.10729 -1.60423 -0.281676
H  -0.68407 -1.513237 -0.109351
H  0.624749 1.968657 0.16492
H  4.014578 -1.724713 0.046933
H  2.302095 -3.375804 -0.111248
H  0.796835 -2.99791 0.753763
H  0.863166 -2.887401 -1.031967
H  3.095289 2.501019 0.281732
