program: Gaussian 09
title: 000242747
version: EM64L-G09RevD.01
frameworkgroup: C1[X(C11H11F4NO2)]
method: RPBEPBE
basis: SDD
operation: Freq
keyword: #p
keyword: freq=noraman
keyword: PBEPBE/SDD
title: #p freq=noraman PBEPBE/SDD
converged: YES YES NO NO
title: Mulliken charges:
elementType: F F F F O O N C C C C C C C C C C C H H H H H H H H H H H
charge: -0.204390 -0.166728 -0.163189 -0.162886 -0.311078 -0.268758 -0.459633 0.043639 0.334514 0.340104 -0.408536 -0.678416 -0.681876 0.125867 -0.376331 -0.308905 0.269810 0.247469 0.237363 0.334094 0.216436 0.254044 0.220482 0.212675 0.234029 0.223803 0.273599 0.356951 0.265850
chargesum: 0.00000
title: Mulliken charges with hydrogens summed into heavy atoms:
elementType: F F F F O O N C C C C C C C C C C C
charge: -0.204390 -0.166728 -0.163189 -0.162886 -0.311078 -0.268758 -0.102682 0.281002 0.334514 0.340104 -0.074442 0.012546 -0.011370 0.125867 -0.102732 -0.043055 0.269810 0.247469
polarizability: 2.02500133e+02 1.11683277e+01 1.41164791e+02 2.24646010e+00 1.29331731e+00 7.89857552e+01
1716.lowfreq: -18.6904 -3.2788 -0.0009 -0.0002 0.0004 3.3328 4.5863 36.4446 45.8717
frequency: -18.5243 36.2921 45.8455 61.3025 79.2926 97.7806 105.2600 138.1792 196.3040 198.2917 205.8583 218.2926 245.5634 276.3164 280.2352 300.7756 339.5083 374.4305 378.0418 394.5280 443.2491 449.3798 462.8827 486.5441 526.6860 561.4924 596.8928 631.6573 665.3271 674.7101 711.1093 716.7389 729.7910 753.8969 815.8234 820.5911 894.1322 901.5656 923.2831 928.4995 942.0114 943.4142 989.7232 994.2196 1013.1594 1050.3444 1100.9185 1105.6276 1156.9053 1166.1179 1172.7587 1189.9087 1243.4995 1261.4703 1313.2409 1328.2923 1338.1333 1382.8294 1399.5812 1400.8940 1439.5550 1457.6616 1461.4736 1465.5318 1474.2602 1488.4670 1531.8788 1605.7249 1630.1856 1652.9263 2991.5824 2995.9105 3030.3638 3087.5631 3096.7753 3101.0756 3106.1154 3176.4936 3182.5966 3195.3757 3535.9576
redmass: 16.5047 3.5504 3.6884 6.2190 6.6447 10.9456 4.9523 5.9833 1.1065 4.9101 4.2686 5.6492 1.2391 7.3909 7.2698 8.5395 5.6380 8.1223 4.6233 3.4081 3.7777 3.0749 5.2027 6.8357 8.1908 8.8525 6.9395 5.1106 11.3285 1.9366 7.1863 3.0996 3.0483 4.8197 1.3792 5.2782 3.7720 3.9158 1.3898 1.2389 1.3547 1.3607 10.1222 8.7512 5.5541 3.3951 1.8278 2.5723 2.1283 2.2260 1.8898 2.0448 2.3204 1.6414 2.5121 1.4247 1.3443 1.2594 1.4707 3.9776 5.0616 1.0998 1.8569 1.1250 1.0651 1.0497 2.9388 6.1102 7.6351 7.8953 1.0357 1.0360 1.0869 1.0992 1.0988 1.1009 1.1008 1.0893 1.0933 1.0976 1.0763
irintensity: 0.0151 0.3751 1.1264 0.3635 0.9960 2.9293 1.9559 0.7355 0.3468 2.7091 11.3015 0.5356 1.5772 3.2486 4.8388 1.3829 3.7852 1.0340 6.2501 9.0079 6.2976 2.7057 1.5757 3.2286 7.3144 31.2084 5.7517 0.3232 2.8881 18.8384 6.8993 61.4986 34.0637 8.3367 71.3608 29.3744 79.5640 20.4290 47.9804 3.9023 0.5576 1.2399 215.0191 175.2534 99.3224 57.6008 152.7476 192.9131 68.5811 350.8113 180.2531 66.9923 32.8115 73.9395 144.9692 23.2135 8.8382 34.5520 60.8298 26.1010 177.0546 18.6713 112.1590 11.2056 5.9279 22.8275 472.5117 25.5873 149.3196 148.5999 14.3648 21.6013 6.0163 7.3911 48.1796 16.0362 34.5650 0.1594 13.5567 0.8884 62.7324
temp: 298.150 k
press: 1.00000 atm
elementType: 9 9 9 9 8 8 7 6 6 6 6 6 6 6 6 6 6 6 1 1 1 1 1 1 1 1 1 1 1
symmnumber: 1
zpe: 543504.6 jmol-1
zpe.correction: 0.207010 hartree
zpe.thermalcorrener: 0.223852 hartree
zpe.thermalcorrenthalpy: 0.224796 hartree
zpe.thermalcorrgfe: 0.161597 hartree
zpe.sumelectzpe: -1029.031063 hartree
zpe.sumelectthermal: -1029.014221 hartree
zpe.sumelectthermalent: -1029.013277 hartree
zpe.sumelectthermalfe: -1029.076476 hartree
dipole: -3.6624 3.0708 0.2368
dipole: 4.7853
quadrupole: -90.0966 -106.8692 -104.8310
quadrupole: 14.2607 0.8500 -0.2040
quadrupole: 10.5023 -6.2703 -4.2320 14.2607 0.8500 -0.2040
hfenergy: -1029.2380728 hartree
pointgroup: C01 [X(C11H11F4N1O2)]
dipole: 1.4367157 1.2098103 -0.1290624 debye
polarizability: 202.3677688|-11.2131551|141.1955138|-4.3330834|1.1681234|79.0873968 unknown
InChI: InChI=1S/C11H11F4NO2/c1-6(2)18-10(17)16-9-5-7(11(13,14)15)3-4-8(9)12/h3-6,16H,1-2H3
charge 0 multiplicity 1
29 atoms
F  0.013789 3.335409 -0.087558
F  -4.677655 -0.988922 0.144953
F  -3.081016 -2.141726 -0.982111
F  -3.034791 -2.068616 1.277409
O  3.345727 0.19468 -0.083811
O  1.631433 -1.424805 -0.007159
N  1.20707 0.904205 -0.057225
C  4.394805 -0.892238 -0.119511
C  -0.199259 0.932095 -0.018472
C  -2.438837 -0.041617 0.068414
C  -1.034688 -0.210008 0.03421
C  4.549659 -1.384283 -1.564802
C  5.653992 -0.248674 0.463066
C  -0.832676 2.203189 -0.034219
C  -3.040344 1.236069 0.051912
C  -2.216052 2.381622 -0.000614
C  2.016712 -0.229677 -0.04813
C  -3.293047 -1.276437 0.12568
H  4.024591 -1.712083 0.523666
H  -0.575732 -1.201328 0.046835
H  5.335945 -2.159509 -1.613907
H  3.608848 -1.827856 -1.931334
H  4.841111 -0.552099 -2.229502
H  6.469162 -0.99333 0.501532
H  5.470509 0.121045 1.486016
H  5.986345 0.598441 -0.162085
H  -4.127429 1.3369 0.079234
H  1.693599 1.803863 -0.092298
H  -2.633476 3.391492 -0.015486
