program: Gaussian 09
title: 000242744
version: EM64L-G09RevD.01
frameworkgroup: C1[X(C10H12FNO3)]
method: RPBEPBE
basis: SDD
operation: Freq
keyword: #p
keyword: freq=noraman
keyword: PBEPBE/SDD
title: #p freq=noraman PBEPBE/SDD
converged: YES YES NO NO
title: Mulliken charges:
elementType: F O O O N C C C C C C C C C C H H H H H H H H H H H H
charge: -0.209565 -0.311629 -0.305033 -0.276835 -0.445614 0.343532 0.151809 -0.492264 -0.273456 0.362172 -0.409458 0.264896 -0.253177 -0.662438 -0.528127 0.327629 0.245412 0.366783 0.253890 0.222216 0.236969 0.216117 0.251439 0.225070 0.226698 0.245971 0.226993
chargesum: 0.00000
title: Mulliken charges with hydrogens summed into heavy atoms:
elementType: F O O O N C C C C C C C C C C
charge: -0.209565 -0.311629 -0.305033 -0.276835 -0.078832 0.343532 0.151809 -0.164635 -0.028044 0.362172 -0.155568 0.264896 0.206008 0.030188 0.171536
polarizability: 1.86966663e+02 -2.10977447e+00 1.42565117e+02 4.76141882e+00 2.62815550e-01 6.83259039e+01
1716.lowfreq: -5.3947 -0.0006 -0.0003 0.0006 1.0441 7.9315 38.3396 46.4854 76.7232
frequency: 38.2914 46.4532 76.7202 84.9056 100.9307 104.3354 155.5581 185.6578 209.1782 235.3070 251.5446 262.4949 295.2184 326.9216 365.6701 377.4127 422.9615 446.0030 454.5953 546.0213 595.5409 600.9293 665.4934 688.0545 689.3767 720.4547 751.5781 760.0575 786.2506 804.2001 853.7891 896.0724 900.9849 942.0227 972.9214 995.6635 1036.1743 1095.1715 1108.1398 1117.4373 1142.8409 1151.2551 1156.9695 1184.5439 1194.3850 1252.1818 1281.2721 1284.1659 1355.7010 1388.7147 1398.4901 1433.0883 1447.4432 1456.5716 1461.7826 1466.1454 1467.3176 1481.2253 1484.4353 1525.7759 1611.5733 1621.2730 1658.0016 2966.2344 2992.0371 3028.6064 3056.2248 3087.4394 3091.6669 3117.9383 3129.2345 3162.8867 3186.2246 3195.6359 3518.7918
redmass: 2.9916 4.0925 4.8272 4.9470 3.5559 4.5546 5.0253 3.0312 1.7097 1.2309 4.2316 2.4314 4.7158 4.1609 6.6833 5.9526 3.4822 7.6290 3.2050 4.5044 3.7805 5.9684 4.8635 5.0707 5.5962 2.9478 1.5035 5.3101 1.4789 1.1959 4.0030 1.3824 1.3483 4.8196 2.8637 8.6659 3.9214 2.1508 1.7327 1.2571 1.7855 1.6332 1.6516 2.4121 2.9952 1.6128 1.1213 2.3484 1.2526 1.2366 7.2430 1.4143 3.3557 1.0932 1.0804 1.4187 1.0774 1.2355 1.0687 3.0030 6.0892 7.7610 8.5761 1.0326 1.0360 1.0597 1.1044 1.0974 1.1033 1.1058 1.1001 1.0884 1.0966 1.0933 1.0759
irintensity: 0.3474 3.4456 0.1469 2.9637 1.0737 0.4617 7.9163 0.8932 5.0666 0.1730 1.7089 0.9419 2.1705 21.5509 4.5668 0.0861 6.7351 2.6924 8.6502 0.5555 2.3601 4.2597 35.2214 4.8859 7.1346 16.7615 94.3964 1.5286 58.8233 3.8334 6.1495 22.6124 25.6130 103.0611 12.5428 58.7469 219.9766 43.5317 17.7988 0.1292 56.7921 102.0436 22.4790 248.5012 192.2896 65.5696 5.4519 11.8186 4.6837 32.3996 11.3336 70.6518 44.7862 7.9204 39.0485 157.8754 27.0690 42.0394 26.7135 598.2316 1.7885 203.6484 196.8982 64.3763 21.0369 36.5971 43.4571 40.2059 0.8519 34.4762 17.9780 8.3326 1.7686 13.0624 76.6977
temp: 298.150 k
press: 1.00000 atm
elementType: 9 8 8 8 7 6 6 6 6 6 6 6 6 6 6 1 1 1 1 1 1 1 1 1 1 1 1
symmnumber: 1
zpe: 546720.7 jmol-1
zpe.correction: 0.208235 hartree
zpe.thermalcorrener: 0.223246 hartree
zpe.thermalcorrenthalpy: 0.224190 hartree
zpe.thermalcorrgfe: 0.165106 hartree
zpe.sumelectzpe: -767.409664 hartree
zpe.sumelectthermal: -767.394652 hartree
zpe.sumelectthermalent: -767.393708 hartree
zpe.sumelectthermalfe: -767.452793 hartree
dipole: 0.2828 5.3602 0.3031
dipole: 5.3762
quadrupole: -67.3850 -87.9200 -89.1998
quadrupole: 10.4045 0.7542 0.1145
quadrupole: 14.1166 -6.4184 -7.6982 10.4045 0.7542 0.1145
hfenergy: -767.6178986 hartree
pointgroup: C01 [X(C10H12F1N1O3)]
dipole: 0.1045156 -2.0373698 -0.5587206 debye
polarizability: 186.2307502|5.432829|135.7344398|-9.0639131|21.3941128|75.8924942 unknown
InChI: InChI=1S/C10H12FNO3/c1-3-15-10(13)12-8-6-7(11)4-5-9(8)14-2/h4-6,12H,3H2,1-2H3
charge 0 multiplicity 1
27 atoms
F  -2.633706 2.610947 1.022396
O  -0.756676 -2.340289 -0.7803
O  3.205415 -0.293461 -0.678492
O  2.079614 1.630933 0.095062
N  0.969239 -0.402574 -0.399134
C  -0.377073 -0.083293 -0.121523
C  -1.328231 -1.13387 -0.325808
C  -0.820625 1.178896 0.333517
C  -2.69774 -0.923555 -0.078868
C  -2.19583 1.34811 0.568068
C  -3.149109 0.339338 0.377165
C  2.067243 0.431897 -0.28354
C  4.500658 0.437809 -0.573026
C  5.076684 0.33326 0.841767
C  -1.655452 -3.468902 -1.025076
H  -0.1103 1.991773 0.495042
H  -3.423323 -1.726278 -0.234784
H  1.141934 -1.358176 -0.725496
H  -4.206308 0.531129 0.576909
H  5.139371 -0.061617 -1.319115
H  4.333383 1.490999 -0.859814
H  6.073853 0.810606 0.874687
H  4.424999 0.848966 1.566879
H  5.188574 -0.721962 1.145604
H  -2.1770 -3.770282 -0.096433
H  -1.006969 -4.287298 -1.36997
H  -2.397325 -3.222805 -1.808817
