program: Gaussian 09
title: 000021093
version: EM64L-G09RevD.01
frameworkgroup: C1[X(C18H28O2)]
method: RPBEPBE
basis: SDD
operation: Freq
keyword: #pfreq=noraman
keyword: PBEPBE/SDD
title: #p freq=noraman PBEPBE/SDD
converged: YES YES NO NO
title: Mulliken charges:
elementType: O O C C C C C C C C C C C C C C C C C C H H H H H H H H H H H H H H H H H H H H H H H H H H H H
charge: -0.442789 -0.453407 -0.190596 0.322839 -0.073848 -0.193909 -0.462529 -0.156967 -0.490119 -0.521481 -0.495545 -0.505209 0.229552 -0.771863 -0.534199 0.223859 -0.527892 -0.555582 -0.448506 -0.096231 0.200293 0.195629 0.197605 0.198576 0.218571 0.199580 0.211425 0.221708 0.221561 0.219216 0.240594 0.218060 0.199108 0.212854 0.190604 0.210944 0.228645 0.209682 0.204949 0.206663 0.243659 0.202953 0.211720 0.327165 0.199358 0.223152 0.200186 0.329963
chargesum: 0.00000
title: Mulliken charges with hydrogens summed into heavy atoms:
elementType: O O C C C C C C C C C C C C C C C C C C
charge: -0.115624 -0.123445 0.009697 0.322839 0.121781 0.003696 -0.045382 0.042613 -0.056986 -0.080704 -0.036892 -0.093247 0.229552 -0.141671 -0.119568 0.223859 -0.077569 -0.140908 -0.025997 0.103955
chargesum: -0.00022
polarizability: 2.21912930e+02 -8.92372043e+00 1.78157398e+02 5.31814472e-01 3.12492892e+00 1.62479265e+02
1716.lowfreq: -17.4058 -12.8674 -9.3444 -1.4492 -0.0863 -0.0019 36.3158 55.9939 64.7974
frequency: 36.0572 55.9715 64.7642 91.0860 114.1348 140.7840 155.7351 179.5546 182.2032 202.5076 233.4551 245.7715 249.4691 262.8622 265.7889 275.3976 308.2734 339.5106 350.1274 356.0075 368.8287 378.3208 415.4494 449.1552 465.3361 499.1748 502.8940 530.9028 548.0203 561.1858 615.1975 622.8064 652.7587 679.8539 685.3253 757.8198 788.7143 802.0454 821.4818 829.0472 838.2590 854.8996 889.0327 906.0190 913.0539 922.0060 943.7234 963.7526 972.3882 982.8973 987.9414 1004.1414 1014.5277 1024.8412 1038.8844 1044.2041 1055.2090 1060.8978 1066.2252 1077.2080 1088.5840 1112.6327 1122.5301 1130.4069 1136.0635 1142.2052 1147.8619 1160.7182 1177.7179 1183.9575 1193.2157 1205.7866 1217.2475 1219.5669 1227.7692 1233.6061 1246.0027 1251.0227 1261.6938 1267.3653 1281.6681 1289.1714 1301.6126 1309.4673 1316.3866 1321.6144 1323.1228 1327.4114 1335.0377 1336.5298 1341.7752 1355.1141 1359.3507 1367.6587 1369.7993 1373.9276 1382.3554 1387.8170 1446.0291 1449.1385 1455.0960 1456.9686 1459.5992 1464.6579 1466.5523 1473.1393 1478.0372 1485.8122 1489.1776 1692.8190 2913.7621 2914.1162 2922.4298 2930.2693 2934.7249 2942.8287 2947.7277 2954.3001 2964.5414 2967.4715 2973.2603 2979.0483 2984.8122 2987.2962 2993.0230 2995.0329 3016.2015 3018.6983 3030.8773 3035.9290 3039.5161 3043.0413 3044.9187 3059.2695 3079.9839 3086.8686 3550.7057 3563.9899
redmass: 4.1576 3.5517 3.4431 3.4104 2.1866 3.0126 3.3523 2.6529 2.3638 1.1670 2.9620 2.4144 2.1529 2.0153 1.3748 1.2742 2.4374 3.3665 2.4038 2.3817 2.6688 2.0854 2.8143 2.9845 3.2978 3.1761 4.3520 3.4319 2.9864 3.4117 2.8506 3.2202 3.1013 2.8092 3.0064 3.1382 1.9913 1.9113 1.8272 2.0052 2.2712 1.9333 2.4655 1.8774 2.5166 2.1963 2.0831 1.9026 2.1158 2.2232 2.9055 1.9318 1.9675 2.2390 2.2267 2.2317 1.7119 2.6338 1.9994 2.0593 1.7096 1.3211 2.0856 1.4715 2.3575 2.0759 1.8969 1.1744 1.5082 1.8504 1.6760 1.5699 1.2903 1.2192 1.2942 1.3923 1.4665 1.2421 1.4469 1.3358 1.3773 1.3077 1.3574 1.3680 1.4945 1.5630 1.4057 1.4835 1.5323 1.4429 1.4468 1.4977 1.5101 1.9303 1.5883 1.4941 1.6967 1.2447 1.0878 1.0853 1.0690 1.0912 1.0933 1.0957 1.0856 1.0753 1.0733 1.0584 1.0920 7.3291 1.0813 1.0843 1.0619 1.0645 1.0827 1.0838 1.0827 1.0422 1.0958 1.0594 1.0757 1.0614 1.0659 1.0747 1.0603 1.0688 1.0939 1.0623 1.0978 1.1002 1.0964 1.1016 1.1027 1.1019 1.1036 1.0946 1.0658 1.0661
irintensity: 0.2612 0.3076 0.2184 0.4311 0.4574 0.8680 0.3151 0.3224 1.9175 0.5411 4.8504 30.2229 18.4040 77.0540 103.0603 107.1798 20.2527 7.9928 2.1210 7.2495 3.1580 0.5527 1.3199 6.8514 3.3023 0.6761 4.6645 6.1170 1.9825 1.6717 0.5405 0.4468 0.3343 1.2352 0.0224 4.1948 1.1530 6.0664 3.3009 13.2123 4.6372 5.0660 9.8750 2.1752 0.3128 32.7840 5.3250 8.1390 7.3399 7.6243 80.5940 9.1960 3.7884 3.2635 3.0889 26.6675 5.4789 12.7940 4.1855 0.7875 7.6526 8.2102 0.3417 5.1406 6.7880 4.1215 7.5713 6.9989 7.9761 1.5421 20.5530 0.4372 9.6989 4.6606 1.8492 18.7645 1.9549 11.0720 1.2551 2.1792 15.6406 1.7761 2.2379 1.1361 13.6688 7.1238 6.6482 4.2941 0.9900 0.7100 7.8340 0.3938 2.3294 1.1514 5.7393 5.5220 5.1379 14.1421 7.7394 5.0974 1.3811 7.0635 11.3636 3.1418 10.3269 0.6157 16.6467 7.9851 17.6394 0.5224 30.0805 35.0247 10.8784 66.3543 36.3492 47.6251 131.2501 48.6494 30.4435 41.3568 36.0990 12.6907 37.5057 62.6228 37.2794 44.8501 42.4261 37.3688 33.0669 66.5389 14.4090 50.0594 29.8099 40.0351 53.7172 42.8138 2.6503 1.6330
temp: 298.150 k
press: 1.00000 atm
elementType: 8 8 6 6 6 6 6 6 6 6 6 6 6 6 6 6 6 6 6 6 1 1 1 1 1 1 1 1 1 1 1 1 1 1 1 1 1 1 1 1 1 1 1 1 1 1 1 1
symmnumber: 1
zpe: 1113372.4 jmol-1
zpe.correction: 0.424061 hartree
zpe.thermalcorrener: 0.443253 hartree
zpe.thermalcorrenthalpy: 0.444197 hartree
zpe.thermalcorrgfe: 0.378122 hartree
zpe.sumelectzpe: -851.580816 hartree
zpe.sumelectthermal: -851.561624 hartree
zpe.sumelectthermalent: -851.560680 hartree
zpe.sumelectthermalfe: -851.626756 hartree
dipole: -1.1266 2.9847 0.3958
dipole: 3.2147
quadrupole: -124.9024 -125.0792 -117.3379
quadrupole: -0.9033 5.4397 2.2604
quadrupole: -2.4626 -2.6394 5.1020 -0.9033 5.4397 2.2604
hfenergy: -852.0048774 hartree
pointgroup: C01 [X(C18H28O2)]
dipole: -0.4412957 -1.1670587 -0.2070553 debye
polarizability: 221.8676538|9.0598682|177.8849893|-0.3750474|3.7857781|162.7969497 unknown
InChI: InChI=1S/C18H28O2/c1-18-9-8-14-13-5-3-12(19)10-11(13)2-4-15(14)16(18)6-7-17(18)20/h12,14-17,19-20H,2-10H2,1H3
charge 0 multiplicity 1
48 atoms
O  4.839226 1.339445 -0.567831
O  -4.629723 1.031179 -1.253286
C  2.029402 -0.948165 0.461425
C  2.648715 0.005373 -0.620191
C  0.477607 -1.035685 0.517395
C  -0.205239 0.358877 0.419614
C  1.89866 1.367925 -0.638722
C  4.10318 0.171585 -0.06258
C  2.656671 -0.471417 1.81881
C  0.36909 1.197469 -0.760768
C  3.96027 0.306175 1.465988
C  -0.143914 -2.002746 -0.519467
C  -1.729881 0.258201 0.351515
C  2.699762 -0.607189 -2.040322
C  -1.64429 -2.210615 -0.224053
C  -2.380861 -0.905656 0.054794
C  -2.495337 1.550788 0.615772
C  -3.901431 -1.007039 0.016475
C  -3.960522 1.31111 1.036273
C  -4.644948 0.344832 0.059183
H  2.410784 -1.972428 0.255116
H  0.222402 -1.453419 1.517408
H  0.042462 0.926215 1.345632
H  2.28431 1.989647 -1.469617
H  2.123767 1.929133 0.28937
H  4.665819 -0.757542 -0.315249
H  2.854847 -1.338749 2.474147
H  1.949122 0.180209 2.364028
H  -0.110799 2.194564 -0.771723
H  0.100771 0.715806 -1.721274
H  3.876157 1.379696 1.712734
H  4.850067 -0.078683 1.992639
H  0.386581 -2.975473 -0.495915
H  -0.029204 -1.599692 -1.543438
H  3.325365 0.015142 -2.71377
H  3.133907 -1.62539 -2.020084
H  1.703192 -0.676733 -2.50765
H  -1.763558 -2.893689 0.646567
H  -2.128156 -2.730707 -1.077523
H  -1.973401 2.139703 1.396806
H  -2.496033 2.17322 -0.301353
H  -4.213789 -1.570766 -0.891108
H  -4.246593 -1.628898 0.872101
H  4.987315 1.229596 -1.541487
H  -4.001471 0.868087 2.050566
H  -4.518992 2.2646 1.058986
H  -5.700885 0.172903 0.362559
H  -4.927526 0.393401 -1.949792
