program: Gaussian 09
title: 000242717
version: EM64L-G09RevD.01
frameworkgroup: C1[X(C14H26O6)]
method: RPBEPBE
basis: SDD
operation: Freq
keyword: #pfreq=noraman
keyword: PBEPBE/SDD
title: #p freq=noraman PBEPBE/SDD
converged: YES YES NO NO
title: Mulliken charges:
elementType: O O O O O O C C C C C C C C C C C C C C H H H H H H H H H H H H H H H H H H H H H H H H H H
charge: -0.271149 -0.271745 -0.253631 -0.253471 -0.193845 -0.193869 -0.372373 -0.372494 -0.341514 -0.340896 -0.252541 -0.253687 -0.686480 -0.686899 -0.300343 -0.299940 -0.238039 -0.237683 0.179454 0.179302 0.206024 0.205093 0.205935 0.205206 0.187769 0.187551 0.187113 0.187675 0.180853 0.216207 0.179893 0.218542 0.212537 0.215979 0.212688 0.216022 0.212587 0.212639 0.223760 0.193522 0.223743 0.193754 0.257351 0.231204 0.257222 0.230976
chargesum: 0.00000
title: Mulliken charges with hydrogens summed into heavy atoms:
elementType: O O O O O O C C C C C C C C C C C C C C
charge: -0.271149 -0.271745 -0.253631 -0.253471 -0.193845 -0.193869 0.038744 0.038647 0.033806 0.033893 0.144519 0.144747 -0.045276 -0.045651 0.116938 0.117557 0.250516 0.250514 0.179454 0.179302
polarizability: 1.89907368e+02 4.83359242e-01 1.68540475e+02 4.29130082e-01 -1.37992787e+01 1.69962750e+02
1716.lowfreq: -12.9712 -10.4598 -8.8436 -0.0001 0.0003 0.0005 3.6122 13.3674 23.4020
frequency: -6.6621 13.1954 23.2321 27.8753 35.3854 39.7060 45.3068 49.0259 54.3033 72.4614 103.6654 107.9660 111.6277 118.1963 122.3475 135.6486 146.0078 175.7675 194.6481 237.4931 238.1625 266.0946 266.2495 280.0496 303.1640 312.5751 356.7413 361.7409 377.5871 397.3073 432.6003 438.3345 489.6909 493.2514 564.2365 738.5764 742.7075 743.4341 751.0278 786.4292 800.5263 805.5961 807.8080 816.6685 836.4620 880.9426 902.8470 905.3479 931.8603 933.4257 936.6966 938.9929 1003.4506 1006.2000 1033.9415 1034.2244 1061.6151 1062.7330 1068.8520 1082.7479 1084.1429 1102.5551 1104.6071 1126.0615 1126.2644 1149.5133 1153.5444 1202.6817 1208.7766 1209.1431 1212.4286 1213.5162 1259.3648 1260.5906 1271.6211 1273.9525 1280.9694 1281.1832 1283.7706 1284.3299 1343.1987 1343.7766 1346.3905 1352.7234 1360.1243 1362.6527 1382.9996 1384.1672 1390.2345 1390.7533 1436.8946 1437.1029 1445.9079 1447.2641 1468.5016 1469.4766 1472.0877 1474.7553 1476.9343 1477.3563 1483.7863 1486.4884 1492.9025 1494.8915 1622.1149 1650.0833 2924.3231 2931.5720 2954.4366 2955.2454 2958.2380 2959.0129 2975.3425 2975.7314 2989.7594 2990.4650 3001.1422 3001.7538 3007.3813 3007.4789 3007.9713 3008.5513 3050.9309 3051.7311 3055.0741 3055.4949 3073.2996 3073.9159 3075.1707 3075.3758 3088.4014 3088.5602
redmass: 3.6707 6.3239 3.9482 11.9320 4.1009 1.8450 4.3776 3.5603 1.5750 4.9641 2.7801 2.6246 3.5383 2.5422 2.1812 3.5817 3.1885 4.6278 5.0876 1.1020 1.0954 4.0773 4.1359 4.4660 2.4775 2.4632 3.7131 3.4279 9.3459 6.0731 2.9747 3.2844 2.3210 2.3224 8.2255 6.1852 1.0784 1.1066 8.7878 4.2678 3.4908 1.1475 1.1742 3.3854 3.8905 5.8635 1.7706 1.9092 2.4484 2.1413 1.2105 1.3140 2.7537 2.7551 3.2771 3.2944 3.5019 3.1006 5.5313 2.2428 2.2493 3.3392 3.6069 2.5833 2.5772 1.4564 1.4732 4.5544 1.1881 1.1521 1.3324 1.3269 1.1596 1.1736 1.1526 1.1456 1.2680 1.2683 1.0820 1.0847 1.4532 1.4359 1.3246 1.3508 1.3302 1.3774 1.3677 1.3428 1.2504 1.2633 1.0865 1.0871 1.0806 1.0831 1.0695 1.0694 1.0744 1.0683 1.0427 1.0427 1.0644 1.0728 1.0895 1.0860 12.0271 12.0330 1.0619 1.0617 1.0646 1.0647 1.0591 1.0589 1.0359 1.0358 1.0597 1.0595 1.0998 1.0994 1.0624 1.0784 1.0790 1.0961 1.0968 1.0968 1.1044 1.1044 1.1009 1.1009 1.0995 1.0995 1.1055 1.1055
irintensity: 0.1170 2.0672 0.4901 0.3501 0.0509 0.0416 1.9401 2.0675 0.4859 0.0712 0.7994 1.2976 1.6508 1.0530 1.2011 7.5501 5.2456 0.9886 0.3812 0.0544 0.0490 2.2631 2.3985 0.2267 0.2224 12.4232 16.6004 0.1416 0.1546 10.4980 6.0043 0.1293 12.3929 13.7853 13.0601 11.1885 9.2180 6.5770 1.7276 6.0270 7.0001 0.9962 1.3192 0.2926 40.8175 25.4784 6.1752 20.7519 26.7051 24.0896 3.5617 6.2248 16.2995 2.9618 1.2361 4.1726 35.2087 58.1498 245.2513 22.8243 25.9381 17.4630 96.9409 15.0497 5.4457 4.1119 4.3114 284.2857 12.5403 6.0238 7.2595 8.7727 7.7432 1.5382 3.2454 2.7746 5.3310 15.1840 0.2222 0.1695 0.2247 0.1176 0.0283 2.5232 22.7499 19.6821 7.3595 4.5637 7.5203 4.6254 5.7363 10.2976 3.1486 22.1602 0.7819 0.8434 2.7300 0.8817 12.0806 13.5839 10.8652 1.1645 25.2018 6.0649 36.5813 400.6612 107.2914 18.3860 23.8287 86.4372 68.6768 51.1346 35.6611 31.9790 86.2818 4.0437 13.4304 19.1114 16.1357 7.9586 18.1323 15.5247 41.2814 29.2337 24.1853 35.6929 63.9837 107.4574 15.4775 81.1659 7.8182 24.7856
temp: 298.150 k
press: 1.00000 atm
elementType: 8 8 8 8 8 8 6 6 6 6 6 6 6 6 6 6 6 6 6 6 1 1 1 1 1 1 1 1 1 1 1 1 1 1 1 1 1 1 1 1 1 1 1 1 1 1
symmnumber: 1
zpe: 1016369.4 jmol-1
zpe.correction: 0.387115 hartree
zpe.thermalcorrener: 0.411394 hartree
zpe.thermalcorrenthalpy: 0.412338 hartree
zpe.thermalcorrgfe: 0.328188 hartree
zpe.sumelectzpe: -998.753189 hartree
zpe.sumelectthermal: -998.728910 hartree
zpe.sumelectthermalent: -998.727966 hartree
zpe.sumelectthermalfe: -998.812116 hartree
dipole: 3.5471 0.1161 -0.0179
dipole: 3.5491
quadrupole: -145.7706 -130.7911 -107.4080
quadrupole: -0.4594 0.1048 -3.8972
quadrupole: -17.7807 -2.8012 20.5819 -0.4594 0.1048 -3.8972
hfenergy: -999.1403041 hartree
pointgroup: C01 [X(C14H26O6)]
dipole: 0.145635 1.3437617 0.3503994 debye
polarizability: 159.8231025|0.7030716|189.3280939|10.2425535|1.7918335|179.2593968 unknown
InChI: InChI=1S/C14H26O6/c1-3-5-7-17-9-11-19-13(15)14(16)20-12-10-18-8-6-4-2/h3-12H2,1-2H3
charge 0 multiplicity 1
46 atoms
O  2.30232 -0.506669 1.876258
O  -2.345613 1.012002 -1.946661
O  0.202671 -2.381286 0.538792
O  -0.741879 -1.649685 -1.837855
O  0.571838 -4.539436 -0.280257
O  -1.579698 -3.807798 -2.160705
C  2.935793 1.272581 0.358156
C  -2.670683 1.873768 0.294991
C  2.522336 2.235147 -0.779554
C  -2.11088 2.049845 1.726116
C  1.786853 0.360953 0.796666
C  -1.703822 1.117001 -0.619367
C  3.684028 3.142944 -1.23759
C  -3.088682 2.800162 2.655632
C  1.302229 -1.377337 2.486361
C  -1.522014 0.378406 -2.971723
C  1.071316 -2.682009 1.725396
C  -1.59667 -1.14759 -2.964615
C  0.060386 -3.406938 -0.381521
C  -0.856304 -2.998926 -1.546732
H  3.291401 1.851234 1.232571
H  3.783202 0.641664 0.025942
H  -2.88839 2.86384 -0.150242
H  -3.630223 1.322265 0.333429
H  2.150118 1.645913 -1.643391
H  1.673758 2.865774 -0.441554
H  -1.882258 1.052877 2.157327
H  -1.148123 2.600318 1.682317
H  0.933135 0.959903 1.186913
H  1.417185 -0.253271 -0.04889
H  -0.74279 1.670135 -0.722429
H  -1.47848 0.108489 -0.218398
H  4.05707 3.760675 -0.399341
H  3.368234 3.826175 -2.04713
H  4.532378 2.540803 -1.613326
H  -2.670726 2.917478 3.6722
H  -3.312056 3.809644 2.262573
H  -4.047462 2.255638 2.743662
H  1.711961 -1.636015 3.480308
H  0.336493 -0.84536 2.629375
H  -1.936168 0.730635 -3.934633
H  -0.462492 0.707694 -2.901245
H  2.022683 -3.11366 1.368831
H  0.544999 -3.429762 2.348485
H  -2.631569 -1.498076 -2.807415
H  -1.206103 -1.580249 -3.905226
