program: Gaussian 09
title: 000242702
version: EM64L-G09RevD.01
frameworkgroup: C1[X(C10H11BrO3S)]
method: RPBEPBE
basis: SDD
operation: Freq
keyword: #p
keyword: freq=noraman
keyword: PBEPBE/SDD
title: #p freq=noraman PBEPBE/SDD
converged: YES YES NO NO
title: Mulliken charges:
elementType: Br S O O O C C C C C C C C C C H H H H H H H H H H H
charge: -0.003725 0.184188 -0.261579 -0.259267 -0.430083 0.631427 0.192693 0.189674 -0.859299 -0.424828 -0.435334 -0.286671 -0.201230 -0.634987 -0.293983 0.281138 0.274468 0.277665 0.276921 0.242442 0.242842 0.273009 0.254675 0.199884 0.232653 0.337308
chargesum: 0.00000
title: Mulliken charges with hydrogens summed into heavy atoms:
elementType: Br S O O O C C C C C C C C C C
charge: -0.003725 0.184188 -0.261579 -0.259267 -0.092774 0.631427 0.192693 0.189674 -0.303693 -0.147163 -0.435334 -0.009750 0.284054 -0.107303 0.138554
polarizability: 1.91384935e+02 2.14737847e+01 1.56004475e+02 1.43774216e+01 -1.09182477e+01 1.11537389e+02
1716.lowfreq: -38.7516 -8.9455 -0.7700 0.0017 0.0019 0.0020 5.0596 19.1178 32.5767
frequency: -38.6069 19.0515 32.5568 45.3971 79.7075 96.2434 102.0377 140.9280 174.0600 223.6050 242.0594 248.0624 277.6780 305.3840 311.4209 349.6984 418.9638 452.1163 471.5659 502.0947 592.6081 630.0396 646.5023 678.9000 681.7377 711.9090 741.6736 790.2521 831.2512 840.5791 849.8282 867.5504 890.7517 934.4499 936.2684 977.2002 987.8351 1059.5905 1065.2761 1066.6558 1102.7444 1119.2265 1136.3638 1166.0313 1210.2071 1228.1929 1241.6055 1251.9641 1289.5610 1317.8984 1359.8986 1373.4982 1383.5242 1413.3145 1443.3414 1447.2860 1461.1737 1462.8183 1486.8052 1602.4028 1621.2026 2944.9527 2998.1069 3019.0846 3034.4522 3064.5812 3088.8974 3099.0903 3111.2089 3173.2321 3194.8433 3559.2718
redmass: 2.3483 6.9902 6.2800 2.9710 7.7796 7.9154 4.9509 6.4876 8.1728 4.3886 3.0706 6.0769 5.4274 3.1516 1.2783 6.2223 3.3849 3.7500 3.8616 5.4294 7.1834 3.8359 7.6843 7.2427 9.3057 4.0579 6.5006 5.5983 2.0443 9.4947 1.4101 1.4742 1.7975 5.0727 2.3005 5.2530 1.4218 3.8234 1.4531 3.9903 1.0298 1.0364 1.3567 1.5914 1.2376 1.2605 1.6586 2.6927 1.2729 1.2462 1.6331 2.4764 1.2103 6.3100 1.0995 1.1181 2.9828 1.0813 1.1893 8.8344 9.0135 1.0695 1.0582 1.0535 1.0608 1.1031 1.0962 1.1191 1.1033 1.0930 1.0937 1.0662
irintensity: 13.6015 1.3862 0.4516 6.5040 2.1308 2.1161 0.3737 0.5812 1.0437 4.9479 17.4969 5.2652 6.2920 11.4481 146.1526 0.1056 14.8069 27.3391 6.6643 8.5097 9.2168 1.2162 13.4794 6.8634 1.8365 2.2647 0.0495 19.3148 7.8327 32.5919 8.1224 35.2683 17.3872 45.0534 51.8244 126.4844 33.9914 23.2077 4.1484 49.8812 25.3274 0.0004 19.1242 10.4929 20.3148 1.7134 79.6731 119.0241 20.5315 7.8335 9.6841 39.8784 23.9305 3.5471 13.1577 20.5644 243.1124 8.5690 14.5880 4.2680 3.7188 59.5097 27.7698 120.4304 13.2577 4.2343 27.3608 28.2377 1.6886 0.3930 1.0306 9.2351
temp: 298.150 k
press: 1.00000 atm
elementType: 35 16 8 8 8 6 6 6 6 6 6 6 6 6 6 1 1 1 1 1 1 1 1 1 1 1
symmnumber: 1
zpe: 500519.2 jmol-1
zpe.correction: 0.190638 hartree
zpe.thermalcorrener: 0.205548 hartree
zpe.thermalcorrenthalpy: 0.206492 hartree
zpe.thermalcorrgfe: 0.145198 hartree
zpe.sumelectzpe: -1023.683118 hartree
zpe.sumelectthermal: -1023.668208 hartree
zpe.sumelectthermalent: -1023.667264 hartree
zpe.sumelectthermalfe: -1023.728558 hartree
dipole: -2.4995 1.0840 -1.0634
dipole: 2.9246
quadrupole: -98.5966 -113.5853 -102.0803
quadrupole: 18.5393 -1.2051 1.4593
quadrupole: 6.1575 -8.8312 2.6738 18.5393 -1.2051 1.4593
hfenergy: -1023.8737562 hartree
pointgroup: C01 [X(C10H11Br1O3S1)]
dipole: -0.8756786 -0.7073917 0.2381344 debye
dipolederiv: -0.2107847 0.2103048 0.1672979 0.1971341 -0.3553178 -0.2217887 0.1374785 -0.1982749 -0.1862409 -0.3284523 -0.0497176 0.0778502 0.0784516 -0.0372174 0.0837392 -0.0432184 0.0280022 -0.2089484 -1.0194287 0.1918345 0.5358544 0.3020546 -0.4924095 -0.2149349 0.6065311 -0.1655397 -0.6724647 -1.1218617 0.0843976 0.5679957 0.0348455 -0.4328935 -0.0465551 0.6761822 -0.078104 -0.6839585 -0.8694092 -0.2253348 -0.156782 -0.1794636 -0.3236037 0.1743484 -0.1925001 0.1626722 -0.4387264 -0.1059276 0.1209839 0.0602453 0.0994652 -0.1786517 -0.1657315 -0.0117635 -0.1439566 -0.1704662 0.5390327 -0.2791917 -0.3539856 -0.7913684 0.2453648 0.5291203 -0.4394846 0.231629 0.369662 0.8412973 -0.0010397 -0.5346103 0.3896464 -0.0224 -0.2714382 -0.5781619 -0.0117557 0.4261684 0.4042734 0.1676312 0.0405482 0.0839732 0.0469288 0.0490189 0.0474929 0.0190834 0.1525246 -0.0911174 0.0588851 -0.0451217 0.0181475 0.0144328 -0.0052059 -0.0101641 0.0122868 -0.1277574 0.1790019 -0.3383097 -0.3605263 -0.3408221 0.6174653 0.4389902 -0.2998373 0.3434951 0.1646482 -0.2316637 0.0248764 0.0886572 0.1898391 -0.0993681 -0.161719 0.1346997 -0.0129498 -0.1789175 1.0114501 -0.1016109 -0.3080092 -0.1341961 0.5459877 0.0775389 -0.3613143 0.0757559 0.8070826 0.0231881 -0.1699364 0.0015154 -0.3752165 0.0471506 -0.1162147 -0.0181916 -0.1093235 0.1107447 0.611749 0.1597457 -0.0299941 0.2385099 0.3294536 -0.0231166 0.0423222 -0.097138 0.3363308 -0.0214459 -0.0214373 0.0047681 0.0103838 0.0269949 -0.1277857 0.0024789 -0.0552159 0.0192568 -0.0108334 0.0162406 -0.0581869 -0.0237524 -0.0051993 0.0911651 -0.0285848 0.0544908 0.023062 0.1439176 -0.0228929 0.0477827 -0.0127888 -0.0008613 -0.009535 0.0287353 -0.0130653 0.1265935 0.1268296 -0.0212993 0.0344031 -0.0333385 0.0108789 0.0053917 0.0464092 0.0081598 0.1505139 0.0219864 0.0074894 -0.0109063 0.0183995 0.0628914 -0.0145656 0.1033389 -0.0326887 -0.184735 -0.1971591 0.0501856 0.0366859 0.0493439 0.0586398 -0.0102185 -0.0572387 0.0084642 0.0331767 -0.0080856 -0.0547748 0.0343867 -0.042231 -0.0293635 0.06993 0.0482913 0.0611989 0.0158319 -0.0134489 0.0924318 0.0205355 0.1462893 -0.0597554 -0.0149278 0.0030854 -0.0486977 -0.042138 -0.0617387 0.0223656 -0.0825018 -0.0020293 -0.1284563 0.1426329 -0.0802724 0.1088665 -0.0472612 0.0078551 0.0300832 0.09697 0.0204684 0.0131508 -0.10175 0.0796538 -0.0292745 0.0178855 0.3807757 0.0480898 0.1251279 0.0582547 0.1461579 -0.1563883 0.1640324 -0.1181204 0.1881327 unknown
polarizability: 183.0825202|-1.8536212|149.9173015|-36.7398721|14.5214312|125.9269765 unknown
InChI: InChI=1S/C10H11BrO3S/c11-8-4-10-9(13-6-14-10)3-7(8)5-15-2-1-12/h3-4,12H,1-2,5-6H2
charge 0 multiplicity 1
26 atoms
Br 0.978729 -2.436599 -2.133262
S  2.712572 1.699584 -1.118425
O  -2.603602 1.477752 0.947978
O  -3.05842 -0.879224 1.103978
O  5.289935 1.491457 0.704239
C  0.203737 0.303853 -1.30168
C  -1.673197 0.740924 0.176923
C  -1.94344 -0.642487 0.27018
C  1.336454 0.852571 -2.13819
C  -0.621041 1.232867 -0.586984
C  -0.093168 -1.07827 -1.182366
C  -1.167874 -1.586671 -0.399893
C  -3.504759 0.467415 1.564304
C  3.294931 0.200301 -0.11201
C  4.139846 0.660358 1.080976
H  1.80216 0.078099 -2.765003
H  0.987528 1.66853 -2.793995
H  -0.398621 2.302026 -0.636324
H  -1.374715 -2.655852 -0.329813
H  -3.407439 0.519413 2.662057
H  -4.535605 0.641155 1.212278
H  2.398863 -0.335781 0.249365
H  3.863571 -0.472167 -0.780895
H  4.468402 -0.236909 1.650904
H  3.545349 1.303227 1.750441
H  5.821203 1.021425 0.012219
