program: Gaussian 09
title: 000242697
version: EM64L-G09RevD.01
frameworkgroup: C1[X(C21H24O6)]
method: RPBEPBE
basis: SDD
operation: Freq
keyword: #pfreq=noraman
keyword: PBEPBE/SDD
title: #p freq=noraman PBEPBE/SDD
converged: YES YES NO NO
title: Mulliken charges:
elementType: O O O O O O C C C C C C C C C C C C C C C C C C C C C H H H H H H H H H H H H H H H H H H H H H H H H
charge: -0.452815 -0.323554 -0.201737 -0.261379 -0.225246 -0.269193 0.204470 0.048908 -0.538818 0.240816 -0.542423 0.094935 -0.551756 -0.752835 0.162821 0.226078 -0.370306 0.450046 -0.520003 0.240386 -0.541299 -0.450969 0.318060 -0.383178 -0.497645 -0.502161 -0.536534 0.231334 0.244071 0.230911 0.237296 0.239349 0.249899 0.255960 0.247352 0.214068 0.296700 0.369185 0.239120 0.267646 0.238862 0.241926 0.245538 0.236305 0.248768 0.242100 0.231539 0.242133 0.245112 0.220215 0.219944
chargesum: 0.00000
title: Mulliken charges with hydrogens summed into heavy atoms:
elementType: O O O O O O C C C C C C C C C C C C C C C C C C C C C
charge: -0.083630 -0.323554 -0.201737 -0.261379 -0.225246 -0.269193 0.204470 0.048908 -0.063413 0.240816 -0.074216 0.094935 -0.062508 -0.035455 0.162821 0.226078 -0.073605 0.450046 -0.280883 0.240386 -0.273653 -0.212108 0.318060 -0.141251 0.232966 0.213611 0.148736
polarizability: 3.65796446e+02 -5.97835663e+00 2.29284232e+02 -1.05844816e+01 3.09138379e+01 1.75389228e+02
1716.lowfreq: -8.4629 -2.2679 -0.0007 -0.0006 0.0006 8.8743 22.7103 34.5267 45.1004
frequency: 22.6851 34.5231 45.0730 49.9589 52.3342 76.0787 84.1432 86.6002 95.3881 105.6585 112.9343 121.9059 149.6360 158.9591 162.5395 178.0210 201.9018 210.1271 222.8014 235.5875 238.8386 248.6699 265.1888 279.7320 295.3337 305.7491 315.1669 328.0715 345.0730 371.8091 395.1134 397.3950 404.1921 433.6357 452.8908 464.1560 486.7486 509.8823 525.7847 537.0499 553.8628 571.5206 599.7688 628.5562 655.4116 667.4256 681.2740 698.2689 715.1194 720.5881 745.2159 774.8432 780.1147 798.3105 802.3788 842.2459 844.8462 855.4096 872.0919 882.5529 902.6824 925.0953 948.6320 951.0636 964.0903 967.9618 983.6468 989.5096 1009.1800 1013.9027 1017.5694 1042.8104 1065.2104 1093.7834 1102.3783 1110.4177 1112.8265 1112.9124 1138.4697 1144.1182 1148.0787 1150.9354 1166.1722 1169.2381 1180.3794 1193.4299 1205.3910 1222.1633 1231.7079 1244.2970 1248.7920 1257.9114 1269.8693 1302.6995 1309.3493 1340.4647 1360.4273 1382.9465 1385.9363 1411.2129 1418.5849 1421.2374 1421.8910 1424.0131 1435.9492 1443.8855 1451.6666 1451.7613 1455.6039 1460.1604 1464.8858 1466.4704 1467.1845 1468.3404 1474.5244 1481.5347 1483.7390 1518.7177 1579.1708 1608.8950 1637.4684 1638.9226 1647.0078 2958.4997 2960.7419 2995.8602 3001.7253 3006.0890 3009.9415 3019.6873 3022.8948 3046.0212 3065.6441 3091.7154 3103.4642 3105.3856 3115.4290 3117.4163 3122.6472 3123.4007 3126.5286 3146.8880 3153.6104 3163.3632 3172.7182 3173.0316 3467.6955
redmass: 5.1082 4.6458 4.6840 6.5007 4.2792 3.1357 1.5424 2.1726 4.3288 1.1495 3.0700 3.6038 3.4887 3.1040 2.7718 1.7830 2.7172 4.5093 4.8967 1.3678 2.6083 3.0365 2.9884 3.6259 4.2494 3.8244 3.7680 3.6842 4.8882 5.2249 2.8627 4.2577 4.1886 3.3614 4.5058 4.3686 3.1948 1.3473 2.8802 4.0708 4.1811 3.6646 5.1663 4.1274 5.5783 3.6040 4.2108 5.0884 5.6366 4.4738 4.0556 4.0122 2.4761 3.0593 1.6563 3.4298 4.4820 1.6618 3.3277 1.9007 2.6360 3.2416 2.5634 1.3674 2.5377 2.8071 3.4877 1.5736 3.7667 3.5436 3.7125 2.7231 2.8728 2.5389 2.1989 1.2571 1.3033 1.2758 2.1105 1.4683 1.5970 1.4413 1.4585 2.3907 1.9132 1.8469 2.6061 2.1456 1.4276 2.3216 1.4664 1.4927 1.6231 1.6145 1.6597 1.5144 1.8313 1.4874 1.2814 3.9745 1.1937 2.1614 1.4292 2.2517 1.1540 1.7036 1.0512 1.0521 1.7899 1.0735 1.0494 1.0534 1.3500 1.0506 1.0653 1.1230 1.0698 3.5051 8.2874 6.2535 7.1496 10.0532 9.1671 1.0330 1.0642 1.0368 1.0295 1.0816 1.0292 1.0729 1.0610 1.1040 1.1017 1.0993 1.1043 1.1003 1.1050 1.0991 1.0966 1.0918 1.0890 1.1045 1.1055 1.0945 1.0921 1.0924 1.0647
irintensity: 0.3306 1.7615 1.2513 3.5703 0.1473 2.3208 0.3629 2.2665 1.0090 0.2186 1.2459 2.4069 1.9493 2.8400 0.7276 1.4727 0.5780 3.3348 5.7399 0.2033 0.4595 1.9224 12.3669 4.8484 3.3886 12.7751 1.5916 10.0398 1.3644 7.9356 4.1725 6.3050 1.5989 1.7908 13.0105 3.9729 7.1085 132.5800 2.4742 7.4183 9.3545 40.9225 3.7309 8.9996 1.0911 1.1096 4.8994 10.7776 8.0505 2.9692 5.1930 13.5354 14.0370 10.7442 0.6932 6.2449 15.1602 85.2634 0.5868 21.5510 6.2194 20.9467 8.7153 3.6729 5.0527 15.8013 30.8511 5.5229 75.9287 39.6670 15.5572 75.1311 170.8417 38.1854 4.8791 0.1881 4.9344 0.2484 107.5918 4.5663 61.7063 6.4206 23.8155 94.7754 71.1648 102.6011 71.4640 18.8062 6.3494 65.3842 44.4309 7.0214 42.1928 41.1039 36.8487 0.4858 2.2356 53.0111 38.5588 4.4054 29.1502 13.3579 17.7123 18.4162 1.4863 5.0024 22.1427 5.2675 25.5071 3.0876 10.5026 15.4070 5.1599 12.7444 47.9620 5.7036 20.0318 93.0980 0.0930 37.9061 125.2044 175.3737 149.0699 94.3665 19.8599 21.5420 31.4343 5.7297 37.0069 20.0501 27.5630 49.3686 27.3052 18.5612 27.5614 9.6638 20.6563 11.8101 19.0219 17.3144 12.9375 12.8585 10.5232 20.2180 6.7040 2.8108 94.0619
temp: 298.150 k
press: 1.00000 atm
elementType: 8 8 8 8 8 8 6 6 6 6 6 6 6 6 6 6 6 6 6 6 6 6 6 6 6 6 6 1 1 1 1 1 1 1 1 1 1 1 1 1 1 1 1 1 1 1 1 1 1 1 1
symmnumber: 1
zpe: 1071057.4 jmol-1
zpe.correction: 0.407944 hartree
zpe.thermalcorrener: 0.434854 hartree
zpe.thermalcorrenthalpy: 0.435799 hartree
zpe.thermalcorrgfe: 0.350616 hartree
zpe.sumelectzpe: -1263.979136 hartree
zpe.sumelectthermal: -1263.952226 hartree
zpe.sumelectthermalent: -1263.951282 hartree
zpe.sumelectthermalfe: -1264.036465 hartree
dipole: 1.7527 -0.4313 -0.2594
dipole: 1.8236
quadrupole: -116.6288 -156.4267 -163.9923
quadrupole: 10.4541 -1.6785 -6.6789
quadrupole: 29.0538 -10.7441 -18.3097 10.4541 -1.6785 -6.6789
hfenergy: -1264.3870801 hartree
pointgroup: C01 [X(C21H24O6)]
dipole: 0.6914094 -0.1567146 -0.1101212 debye
polarizability: 365.6169697|-2.8565129|229.9067637|-13.9780876|30.0034169|174.9461736 unknown
InChI: InChI=1S/C21H24O6/c1-20(19(23)27-4)10-9-15-16-11-14(25-2)7-5-13(16)6-8-17(15)21(20,24)12-18(22)26-3/h5-8,11,24H,9-10,12H2,1-4H3
charge 0 multiplicity 1
51 atoms
O  -2.421155 0.481113 1.599531
O  -4.418488 -1.167091 0.664809
O  -3.963293 -2.435731 -1.225328
O  -1.043689 2.731659 -1.54647
O  -2.769291 3.179711 -0.044015
O  5.413521 -1.535173 -0.850348
C  -2.065072 -1.511931 0.106967
C  -1.793139 0.032841 0.353877
C  -1.179341 -2.006018 -1.066077
C  -0.288028 0.293884 0.522756
C  0.326752 -1.812444 -0.795066
C  0.688657 -0.531417 -0.05477
C  -2.379606 0.871402 -0.851697
C  -1.767346 -2.320747 1.406357
C  -3.535612 -1.767109 -0.261318
C  2.090539 -0.198223 0.115768
C  0.089716 1.449108 1.288875
C  2.458466 0.982277 0.872942
C  1.426668 1.786861 1.457097
C  -2.123883 2.361389 -0.736503
C  3.135446 -1.003882 -0.433841
C  3.842209 1.302545 1.033632
C  4.483537 -0.662035 -0.257481
C  4.849544 0.506582 0.483483
C  -5.867406 -1.395515 0.426569
C  -0.63062 4.15101 -1.459109
C  6.836638 -1.226323 -0.698534
H  -1.469153 -1.480987 -1.993488
H  -1.392377 -3.073767 -1.251991
H  0.861672 -1.853357 -1.763602
H  0.713954 -2.671137 -0.207844
H  -3.474924 0.725499 -0.872733
H  -1.94516 0.51718 -1.798984
H  -0.724447 -2.155132 1.723298
H  -2.420914 -2.00171 2.232673
H  -1.914478 -3.400802 1.223681
H  -0.704417 2.034289 1.760031
H  -3.386587 0.2405 1.547015
H  1.706917 2.665047 2.051101
H  2.915933 -1.908596 -1.006249
H  4.11065 2.196944 1.608582
H  5.899634 0.778639 0.624587
H  -6.161017 -0.992081 -0.556642
H  -6.374248 -0.863126 1.243314
H  -6.084498 -2.475541 0.457717
H  -1.500955 4.815816 -1.590232
H  0.10242 4.282614 -2.267188
H  -0.168906 4.341313 -0.475182
H  7.361548 -2.030994 -1.234304
H  7.141678 -1.229359 0.36622
H  7.091148 -0.249696 -1.154781
