program: Gaussian 09
title: 000242693
version: EM64L-G09RevD.01
frameworkgroup: C1[X(C19H24O4)]
method: RPBEPBE
basis: SDD
operation: Freq
keyword: #pfreq=noraman
keyword: PBEPBE/SDD
title: #p freq=noraman PBEPBE/SDD
converged: YES YES NO NO
title: Mulliken charges:
elementType: O O O O C C C C C C C C C C C C C C C C C C C H H H H H H H H H H H H H H H H H H H H H H H H
charge: -0.272977 -0.216873 -0.411185 -0.241032 0.236626 -0.290980 -0.526328 0.335945 0.105370 -0.526904 0.087759 -0.564744 -0.775847 0.319522 -0.494604 0.124579 -0.483491 -0.544072 -0.429341 -0.408982 -0.450866 0.177965 -0.503180 0.288840 0.235928 0.237734 0.220281 0.226720 0.274080 0.273419 0.250380 0.244439 0.217890 0.212619 0.214477 0.274005 0.215242 0.222382 0.208277 0.202850 0.205827 0.202845 0.231987 0.239093 0.236226 0.241179 0.376921
chargesum: 0.00000
title: Mulliken charges with hydrogens summed into heavy atoms:
elementType: O O O O C C C C C C C C C C C C C C C C C C C
charge: -0.272977 -0.216873 -0.034264 -0.241032 0.236626 -0.002141 -0.052666 0.335945 0.105370 -0.079903 0.087759 -0.017245 -0.063138 0.319522 -0.067508 0.124579 -0.209486 -0.106448 -0.018215 -0.000309 -0.218879 0.177965 0.213319
polarizability: 2.65865796e+02 -1.53268700e-01 2.00685814e+02 1.37450896e-01 -2.01957968e+01 1.65322017e+02
1716.lowfreq: -7.2889 -4.4660 -0.0006 -0.0001 0.0004 8.5845 26.0170 33.6170 40.8565
frequency: 25.9938 33.5903 40.8137 47.9222 59.5785 85.7545 96.6031 103.1178 114.0047 126.2190 142.4934 178.2462 182.3455 197.0876 218.9420 233.4476 249.2313 274.8675 284.9648 300.2761 307.4857 319.5512 354.7050 390.3306 404.3274 431.7051 437.7657 462.3356 478.0205 494.0307 498.8842 517.9121 546.4819 572.3037 602.0008 608.1696 643.1800 655.9566 679.9100 714.6990 725.9146 751.6010 763.9096 814.7248 824.4019 841.4459 845.1342 858.1908 879.1872 885.8968 908.5846 923.1165 936.0412 953.4772 963.8134 970.6425 975.1755 986.7345 1031.3810 1037.8629 1069.3414 1070.3393 1080.6888 1096.2589 1102.9131 1104.0295 1113.5398 1132.6694 1147.0735 1156.0751 1171.2553 1185.0166 1186.7803 1195.4062 1214.7829 1224.0874 1230.6202 1241.9934 1250.3771 1254.5036 1258.2380 1269.2244 1297.0637 1307.2246 1321.4733 1332.7825 1335.7226 1345.2681 1352.8515 1357.3122 1363.7312 1380.5078 1387.2978 1420.4435 1422.6587 1429.8316 1443.9505 1452.3173 1456.3250 1462.5437 1464.6752 1467.9575 1471.3182 1473.2381 1479.6802 1484.5573 1486.4367 1587.1735 1605.4155 1621.0710 1663.7181 2944.5224 2953.5288 2953.7148 2974.1001 2974.7167 2977.7887 2987.5841 2998.3571 3002.3214 3004.9037 3013.8472 3019.8392 3024.2400 3037.4677 3045.9333 3060.4051 3070.0427 3083.8232 3099.6932 3103.0178 3112.3961 3145.2757 3148.5528 3507.9007
redmass: 6.2648 6.4702 4.3001 5.8135 5.2019 3.6848 2.2330 1.2096 2.8260 3.1900 3.2166 3.2824 3.2330 4.1131 1.6886 4.1268 1.7383 2.4981 2.7358 1.8422 3.3577 4.0372 3.7388 3.6568 3.2151 3.9474 3.8938 2.7828 2.8252 3.0837 3.5633 2.6517 3.9931 3.8715 2.9933 3.0549 1.7686 2.8068 3.5458 3.8533 3.6717 3.3154 3.4900 3.1509 1.7117 1.7820 2.4276 2.7664 2.5517 2.7542 1.4894 2.6473 2.5848 1.9445 2.0750 1.7058 2.6544 2.2856 2.1184 3.2012 2.3441 2.4619 1.8939 1.8831 2.0530 2.3280 1.2684 1.1741 1.4670 1.6777 1.7924 1.4610 2.7361 1.4149 2.1836 1.6714 1.5417 1.9476 1.4440 1.4545 1.7658 1.2705 1.5433 1.6118 1.5554 1.5365 1.7235 1.4272 1.5752 1.8384 1.6570 2.3523 1.2878 1.9649 1.5234 1.0952 1.1759 1.0504 1.1062 1.1185 1.0545 1.0937 1.0658 1.1286 1.2420 1.7765 1.0637 7.1350 6.7874 10.1663 8.1569 1.0655 1.0654 1.0651 1.0650 1.0667 1.0620 1.0360 1.0800 1.0297 1.0900 1.0750 1.0944 1.0841 1.0981 1.1042 1.1010 1.0925 1.0986 1.1002 1.1044 1.0881 1.0955 1.1046 1.0639
irintensity: 0.4779 1.1261 0.0166 0.7396 1.6395 0.3442 0.1302 0.1204 0.8740 0.6077 2.6390 0.3728 2.0765 5.3974 0.2503 2.6186 1.6527 7.7275 4.5445 0.1323 2.2527 12.8168 4.1558 0.8253 5.6594 2.3102 2.7456 10.2802 1.3282 0.4233 9.1467 23.1642 6.2989 20.6631 5.2094 12.8294 78.8240 40.4990 1.3262 1.4259 6.2856 3.6203 5.6618 7.4032 14.0216 7.7593 13.9522 8.9981 4.0211 0.4855 4.9489 12.5655 14.1901 2.8804 14.0481 3.1411 14.3897 16.8196 45.4896 107.9604 145.6828 138.8765 2.5734 29.9667 17.7747 40.1609 0.0883 1.3045 23.8833 2.3123 7.5834 7.7893 89.3418 10.4512 0.8312 4.8760 5.4245 7.1504 0.3667 6.2715 3.8778 2.5611 32.9190 6.1132 3.2747 1.1291 0.7068 1.6707 2.2108 4.0660 32.5611 2.9127 21.6531 12.6735 15.9793 17.7541 3.0647 13.8064 12.4887 2.7602 9.9254 10.0514 11.5543 15.1359 4.2282 15.1065 16.6635 3.3829 0.8889 157.7295 169.7678 28.2479 38.9111 20.3200 34.4780 16.4119 33.4186 22.9133 12.1462 38.9828 47.0836 29.8127 34.0808 1.7166 77.1563 66.6103 25.6921 11.0861 22.6504 16.3497 26.4635 16.3733 8.1358 13.1380 23.1021
temp: 298.150 k
press: 1.00000 atm
elementType: 8 8 8 8 6 6 6 6 6 6 6 6 6 6 6 6 6 6 6 6 6 6 6 1 1 1 1 1 1 1 1 1 1 1 1 1 1 1 1 1 1 1 1 1 1 1 1
symmnumber: 1
zpe: 1026792.0 jmol-1
zpe.correction: 0.391084 hartree
zpe.thermalcorrener: 0.413525 hartree
zpe.thermalcorrenthalpy: 0.414469 hartree
zpe.thermalcorrgfe: 0.338675 hartree
zpe.sumelectzpe: -1037.623877 hartree
zpe.sumelectthermal: -1037.601437 hartree
zpe.sumelectthermalent: -1037.600493 hartree
zpe.sumelectthermalfe: -1037.676286 hartree
dipole: -0.6911 -0.2313 -0.0622
dipole: 0.7315
quadrupole: -120.4982 -132.3568 -140.6875
quadrupole: 4.8636 -5.6007 6.6777
quadrupole: 10.6827 -1.1760 -9.5067 4.8636 -5.6007 6.6777
hfenergy: -1038.0149614 hartree
pointgroup: C01 [X(C19H24O4)]
dipole: 0.2638009 -0.1104718 0.0319681 debye
polarizability: 265.438475|-4.9928429|202.2799504|3.3424521|18.8774797|164.1552014 unknown
InChI: InChI=1S/C19H24O4/c1-19(18(22)23-2)10-9-14-13-6-4-3-5-12(13)7-8-15(14)16(19)11-17(20)21/h7-8,16,20H,3-6,9-11H2,1-2H3
charge 0 multiplicity 1
47 atoms
O  -3.991213 -0.323174 0.909443
O  -3.93442 -1.661415 -0.987657
O  -1.634032 3.41147 -1.948761
O  -1.718969 3.295624 0.364752
C  -1.807705 -1.095389 0.191456
C  -1.251611 0.370465 0.25263
C  -1.112111 -1.839814 -0.97638
C  0.276992 0.36438 0.37376
C  1.072273 -0.678277 -0.177803
C  0.419458 -1.918063 -0.788554
C  2.500527 -0.6160 -0.08783
C  -1.689662 1.208298 -0.98669
C  -1.56708 -1.81274 1.552346
C  3.125608 0.483794 0.563742
C  3.340585 -1.763474 -0.652273
C  -3.323672 -1.081043 -0.059484
C  0.913882 1.446383 1.03109
C  4.64413 0.59325 0.689267
C  4.851833 -1.457107 -0.752931
C  5.360281 -0.762765 0.527018
C  2.315173 1.501845 1.123094
C  -1.670548 2.704176 -0.736343
C  -5.466352 -0.260861 0.779358
H  -1.679091 0.864952 1.144336
H  -1.35369 -1.323348 -1.923542
H  -1.529716 -2.857818 -1.074844
H  0.879404 -2.148524 -1.76954
H  0.669077 -2.788269 -0.144997
H  -1.062612 0.997548 -1.869546
H  -2.731469 0.964205 -1.281065
H  -0.492984 -1.812232 1.803242
H  -2.110473 -1.298229 2.362775
H  -1.913854 -2.861762 1.508864
H  3.193842 -2.660676 -0.012201
H  2.962821 -2.053738 -1.652424
H  0.298747 2.23645 1.47557
H  5.023475 1.289713 -0.088497
H  4.898161 1.054126 1.663123
H  5.406565 -2.395748 -0.942154
H  5.040183 -0.790605 -1.618914
H  6.455461 -0.611445 0.481326
H  5.153974 -1.407578 1.404863
H  2.793359 2.339988 1.645566
H  -5.748573 0.161297 -0.200135
H  -5.792475 0.391419 1.601374
H  -5.900502 -1.270513 0.874191
H  -1.657895 4.388217 -1.754421
