program: Gaussian 09
title: 000242682
version: EM64L-G09RevD.01
frameworkgroup: C1[X(C13H15N3)]
method: RPBEPBE
basis: SDD
operation: Freq
keyword: #pfreq=noraman
keyword: PBEPBE/SDD
title: #p freq=noraman PBEPBE/SDD
converged: NO YES NO NO
title: Mulliken charges:
elementType: N N N C C C C C C C C C C C C C H H H H H H H H H H H H H H H
charge: -0.278316 -0.083599 -0.010700 -0.167112 -0.133789 -0.164132 -0.324716 -0.528934 -0.456688 -0.461379 0.405980 -0.375838 -0.351304 -0.200859 -0.229912 -0.259060 0.267832 0.262740 0.263178 0.257071 0.259297 0.231579 0.233626 0.205120 0.210369 0.233790 0.278530 0.239596 0.226218 0.222929 0.228484
chargesum: 0.00000
title: Mulliken charges with hydrogens summed into heavy atoms:
elementType: N N N C C C C C C C C C C C C C
charge: -0.278316 -0.083599 -0.010700 0.100720 0.128950 0.099047 -0.067646 -0.038058 -0.017942 -0.017220 0.405980 -0.097308 -0.111708 0.025359 -0.006984 -0.030576
polarizability: 2.26133802e+02 -1.50902462e+01 1.50381630e+02 1.07629053e+01 7.18227883e+00 9.49348877e+01
1716.lowfreq: -14.3569 -1.7437 0.0005 0.0006 0.0006 14.4553 45.1811 68.5687 94.9070
frequency: 44.9080 68.5318 94.8699 144.8654 206.6651 231.9100 260.0407 285.3951 345.4302 372.1000 408.1876 449.8919 475.9975 507.2340 539.7596 579.1694 613.6669 668.8274 695.2891 741.9365 753.6737 758.0903 795.5083 830.6716 836.0199 850.6323 865.9647 869.4609 875.9171 885.9291 900.6953 925.6840 950.8014 961.6678 965.4213 968.1023 979.2308 982.8383 989.9578 1009.6306 1026.5749 1041.4906 1049.5613 1054.7038 1092.8377 1106.9977 1121.3625 1154.9750 1171.6893 1187.0375 1188.5765 1199.9773 1209.9909 1235.1487 1252.7052 1263.8218 1276.3399 1285.3285 1296.7315 1302.8954 1318.4692 1325.7194 1349.4641 1379.2219 1399.7313 1450.0863 1467.8506 1477.2224 1490.6524 1495.0664 1585.8894 1614.2827 2999.3381 3013.2325 3015.3031 3026.0589 3051.6982 3053.7461 3076.9202 3079.3230 3094.2403 3094.6230 3127.5400 3136.3056 3153.3518 3166.2250 3183.6773
redmass: 4.1628 3.4412 3.9884 4.6781 4.1895 3.4802 2.6175 4.0748 5.0394 4.4534 2.9289 2.3795 4.7967 3.1642 4.4111 5.1718 6.4428 6.0585 1.9793 5.4130 2.5229 1.7260 1.9147 1.5173 2.7588 3.4005 2.9483 2.4722 4.1079 3.1221 1.4378 3.0401 2.5307 2.1419 1.6871 1.4045 4.4875 5.5774 1.3061 1.5974 2.1968 1.4122 1.7252 2.9974 1.5880 1.0943 1.1692 2.2789 1.0501 1.5849 1.1283 1.9952 1.2524 1.3509 1.4450 1.3224 1.4443 1.5183 1.4981 1.5916 1.4995 1.3550 3.9037 5.9228 7.9753 2.5014 1.0798 1.0885 2.5624 1.1213 6.4754 6.1402 1.0592 1.0661 1.0827 1.0606 1.0903 1.1018 1.1008 1.0922 1.0992 1.0987 1.0848 1.0892 1.0932 1.0988 1.0959
irintensity: 0.8410 0.0794 0.7496 1.4029 2.8296 2.7833 0.0972 0.7528 0.1848 0.3690 0.0386 0.8696 1.3955 12.1874 2.2193 1.3449 0.4233 1.9570 36.0953 14.1226 1.7120 89.2504 1.3100 0.3859 1.9962 20.3290 9.1305 15.4195 83.4272 14.5456 8.3366 3.8108 99.3863 12.6184 2.9145 2.6847 1.3545 9.6846 1.1266 1.1765 45.8230 4.0893 1.1122 27.1020 36.1094 0.5405 7.2190 1.5361 0.3701 0.6718 0.6627 1.6695 1.0133 27.1357 5.7167 3.3376 1.1496 7.3822 5.0899 1.5088 4.6446 12.3349 74.9818 35.9287 76.2942 5.3351 2.4172 17.3271 149.4867 8.3053 5.1562 111.9876 28.9166 49.6846 36.8339 21.3433 18.7943 5.0264 43.5269 47.0240 40.7841 10.8014 4.6698 12.7147 37.6348 19.3338 2.5298
temp: 298.150 k
press: 1.00000 atm
elementType: 7 7 7 6 6 6 6 6 6 6 6 6 6 6 6 6 1 1 1 1 1 1 1 1 1 1 1 1 1 1 1
symmnumber: 1
zpe: 674900.5 jmol-1
zpe.correction: 0.257056 hartree
zpe.thermalcorrener: 0.269094 hartree
zpe.thermalcorrenthalpy: 0.270038 hartree
zpe.thermalcorrgfe: 0.218429 hartree
zpe.sumelectzpe: -667.429286 hartree
zpe.sumelectthermal: -667.417248 hartree
zpe.sumelectthermalent: -667.416304 hartree
zpe.sumelectthermalfe: -667.467912 hartree
dipole: -1.4591 -3.8142 -0.3451
dipole: 4.0983
quadrupole: -84.6151 -100.3547 -94.6839
quadrupole: 3.4559 1.4166 1.8579
quadrupole: 8.6028 -7.1368 -1.4660 3.4559 1.4166 1.8579
hfenergy: -667.6863417 hartree
pointgroup: C01 [X(C13H15N3)]
dipole: 0.5181586 1.526834 0.0121028 debye
polarizability: 226.6481632|-11.1161631|150.3409611|-14.2659318|-1.6065437|94.4611961 unknown
InChI: InChI=1S/C13H15N3/c1-2-4-11(5-3-1)16-13-10-7-6-9(8-10)12(13)14-15-16/h1-5,9-10,12-13H,6-8H2
charge 0 multiplicity 1
31 atoms
N  -0.222489 -0.580458 -0.438855
N  1.404498 -2.106433 -0.722138
N  0.151467 -1.946766 -0.428281
C  1.46089 1.156522 0.435756
C  3.118564 -0.387359 0.096419
C  0.921352 0.310578 -0.762201
C  2.060785 -0.756038 -0.982995
C  2.215121 0.082233 1.271693
C  2.638748 2.013677 -0.122093
C  3.782625 0.951602 -0.348598
C  -1.569814 -0.20095 -0.246527
C  -2.560775 -1.17893 0.050514
C  -1.946457 1.16607 -0.355637
C  -3.899597 -0.783872 0.232871
C  -3.294441 1.542904 -0.173044
C  -4.280635 0.576087 0.1237
H  0.68457 1.732576 0.962696
H  3.821143 -1.207736 0.305487
H  0.689384 0.928973 -1.648027
H  2.490783 -0.789858 -1.998226
H  1.560803 -0.709817 1.673468
H  2.792998 0.522858 2.102204
H  2.942455 2.777606 0.615053
H  2.363407 2.544276 -1.05219
H  4.128568 0.916355 -1.397375
H  4.661748 1.172015 0.282546
H  -2.266202 -2.228207 0.12756
H  -1.198633 1.931404 -0.585538
H  -4.653484 -1.545946 0.460668
H  -3.570969 2.599514 -0.263718
H  -5.324616 0.87372 0.266308
