program: Gaussian 09
title: 000242680
version: EM64L-G09RevD.01
frameworkgroup: C1[X(C13H16ClNO)]
method: RPBEPBE
basis: SDD
operation: Freq
keyword: #p
keyword: freq=noraman
keyword: PBEPBE/SDD
title: #p freq=noraman PBEPBE/SDD
converged: YES YES NO NO
title: Mulliken charges:
elementType: Cl O N C C C C C C C C C C C C C H H H H H H H H H H H H H H H H
charge: -0.042767 -0.208773 -0.045266 -0.157014 -0.431853 -0.434058 -0.397478 -0.384277 0.080840 -0.616396 0.324537 -0.349235 -0.346282 -0.231240 -0.219721 -0.106812 0.212830 0.203907 0.241726 0.235195 0.214996 0.220097 0.168217 0.164580 0.220767 0.225816 0.223890 0.185273 0.243505 0.285654 0.258261 0.261081
chargesum: 0.00000
title: Mulliken charges with hydrogens summed into heavy atoms:
elementType: Cl O N C C C C C C C C C C C C C
charge: -0.042767 -0.208773 -0.045266 0.055817 0.013779 0.016133 -0.009164 0.001070 0.080840 0.018584 0.324537 -0.105730 -0.060628 0.027021 0.041360 -0.106812
polarizability: 2.38205739e+02 1.24639051e+01 1.48468621e+02 4.38040452e+00 -8.54173668e+00 9.76459229e+01
1716.lowfreq: -5.8112 -0.0014 0.0008 0.0016 2.5661 11.7103 28.6987 48.0936 63.6157
frequency: 28.4188 48.0488 63.5434 83.8985 111.9838 163.1981 200.3854 210.8702 218.5510 247.5929 266.2219 291.8717 312.0177 344.5812 352.9367 384.7983 409.7005 461.1028 472.5783 481.6253 507.7813 550.5268 622.6086 666.3390 700.1976 734.7774 742.0580 805.0947 808.7589 832.0480 848.2147 859.2551 921.6114 962.7347 970.2609 982.5473 996.4581 999.2541 1020.6960 1047.7857 1066.5452 1072.3961 1084.1286 1107.3345 1112.2364 1128.6613 1140.5565 1153.3731 1181.8161 1191.8562 1211.2268 1261.3001 1267.2757 1279.9636 1291.8339 1295.3923 1312.2770 1326.5893 1347.1128 1359.3641 1371.6186 1374.4725 1396.8205 1432.0387 1449.6589 1460.7225 1461.7599 1463.6002 1472.4082 1477.4748 1482.1663 1557.6521 1586.3026 1600.6516 2797.3662 2810.2859 2854.2033 2961.3888 2996.9547 3007.0095 3017.6664 3021.5893 3027.9594 3062.3164 3076.2084 3079.5079 3151.6098 3154.1483 3172.7192 3176.5786
redmass: 4.6301 4.1644 3.2093 9.8259 4.5529 4.4902 4.2148 3.3309 1.4321 1.7868 3.5741 3.9491 7.1081 2.5495 2.4448 2.5831 2.9036 3.5352 3.6209 3.2813 5.6421 2.3449 7.1115 4.5258 6.1863 3.8330 3.3274 2.0319 1.7648 1.5696 2.0872 1.8486 1.9533 1.3815 2.2588 1.5792 1.3820 3.6484 2.8083 2.1516 1.7474 2.8187 1.7924 1.5832 1.8309 1.6671 2.1515 1.4090 1.1967 1.5698 2.0689 1.6683 1.3660 1.7235 1.4145 1.2843 1.4290 1.3335 1.3404 1.8824 3.5521 1.4658 3.9846 1.1712 1.0871 1.0758 1.0831 1.0637 2.3244 1.1093 1.0572 8.6994 6.9436 7.5858 1.0716 1.0697 1.0573 1.0814 1.0607 1.0646 1.0723 1.0845 1.0857 1.1035 1.1010 1.1006 1.0879 1.0889 1.0961 1.0973
irintensity: 0.0514 0.0259 0.6391 2.4130 0.0454 1.8847 5.4959 5.8836 0.3733 0.1820 1.0592 3.8476 2.0219 3.2262 3.0377 3.6218 0.1052 5.0962 1.9251 12.0888 25.6801 1.8883 0.8665 8.9048 4.7715 11.3440 5.0950 24.1239 10.9159 11.2626 19.9205 25.6234 9.3736 4.8988 93.5377 24.9578 1.2041 19.0515 0.8523 7.7689 14.9015 58.8621 17.9032 10.6219 5.6492 8.5145 19.8481 6.0445 39.0913 8.3361 40.1350 116.1858 14.9849 40.8615 5.6411 2.1140 33.4911 15.9379 1.4630 2.6221 28.5702 7.5363 21.8029 4.1324 6.9285 12.2794 11.2084 16.1239 20.4086 9.0354 8.4878 110.1802 90.8845 50.7622 53.7504 118.0171 195.4300 24.5330 19.1959 15.8282 45.4696 73.4276 36.1416 28.4881 33.8586 28.9772 7.2080 0.3728 6.9428 1.9735
temp: 298.150 k
press: 1.00000 atm
elementType: 17 8 7 6 6 6 6 6 6 6 6 6 6 6 6 6 1 1 1 1 1 1 1 1 1 1 1 1 1 1 1 1
symmnumber: 1
zpe: 687129.2 jmol-1
zpe.correction: 0.261714 hartree
zpe.thermalcorrener: 0.276766 hartree
zpe.thermalcorrenthalpy: 0.277710 hartree
zpe.thermalcorrgfe: 0.218406 hartree
zpe.sumelectzpe: -1093.810339 hartree
zpe.sumelectthermal: -1093.795287 hartree
zpe.sumelectthermalent: -1093.794343 hartree
zpe.sumelectthermalfe: -1093.853647 hartree
dipole: 1.1163 -2.8246 1.0786
dipole: 3.2230
quadrupole: -103.6386 -105.0782 -103.2365
quadrupole: -8.0703 4.3205 0.1882
quadrupole: 0.3458 -1.0938 0.7479 -8.0703 4.3205 0.1882
hfenergy: -1094.0720529 hartree
pointgroup: C01 [X(C13H16Cl1N1O1)]
dipole: -0.4972033 1.1663244 0.0192112 debye
polarizability: 234.3906766|13.137712|148.392052|-20.568371|-13.3087942|101.5375546 unknown
InChI: InChI=1S/C13H16ClNO/c1-15-8-6-11(7-9-15)13(16)10-2-4-12(14)5-3-10/h2-5,11H,6-9H2,1H3
charge 0 multiplicity 1
32 atoms
Cl 5.562179 1.33761 -0.818511
O  -0.02355 -2.3163 0.605904
N  -4.055563 0.297931 -0.093393
C  -1.211007 -0.189469 0.520283
C  -2.352398 -0.878597 1.300704
C  -1.71149 0.149722 -0.92088
C  -3.622399 -0.006915 1.290289
C  -2.997703 0.996579 -0.853841
C  0.047148 -1.061177 0.444065
C  -5.343333 1.015194 -0.13392
C  1.377822 -0.422438 0.132957
C  1.559271 0.981183 0.000728
C  2.50427 -1.275004 -0.030539
C  2.829628 1.52355 -0.28805
C  3.778571 -0.752061 -0.319237
C  3.920621 0.645956 -0.444638
H  -0.964235 0.768805 1.024483
H  -2.040143 -1.070203 2.344668
H  -2.566625 -1.857819 0.839117
H  -1.929453 -0.793845 -1.454887
H  -0.937976 0.694747 -1.494109
H  -4.444681 -0.542427 1.800807
H  -3.432238 0.936938 1.871788
H  -2.755713 1.996459 -0.397857
H  -3.369844 1.186386 -1.878442
H  -6.118141 0.416991 0.378375
H  -5.659561 1.156315 -1.18324
H  -5.306239 2.022843 0.35486
H  0.716605 1.667749 0.127855
H  2.351605 -2.353898 0.076341
H  2.97034 2.603521 -0.387787
H  4.643233 -1.409828 -0.444293
