program: Gaussian 09
title: 000242678
version: EM64L-G09RevD.01
frameworkgroup: C1[X(C8H10O4S)]
method: RPBEPBE
basis: SDD
operation: Freq
keyword: #p
keyword: freq=noraman
keyword: PBEPBE/SDD
title: #p freq=noraman PBEPBE/SDD
converged: YES YES NO NO
title: Mulliken charges:
elementType: S O O O O C C C C C C C C H H H H H H H H H H
charge: 0.982297 -0.238203 -0.605573 -0.672504 -0.554671 -0.634609 0.010722 0.424638 -0.398952 -0.376585 -0.217775 -0.223078 -0.231790 0.239629 0.273902 0.213500 0.231280 0.314611 0.395990 0.230005 0.232675 0.232764 0.371727
chargesum: 0.00000
title: Mulliken charges with hydrogens summed into heavy atoms:
elementType: S O O O O C C C C C C C C
charge: 0.982297 -0.238203 -0.233847 -0.276514 -0.554671 -0.121077 0.224222 0.424638 -0.167671 -0.061974 0.012230 0.009597 0.000974
polarizability: 1.65130061e+02 1.95605535e+00 1.27275004e+02 4.40357674e-01 -4.70617704e+00 8.46603714e+01
1716.lowfreq: -7.8639 -0.0016 -0.0009 0.0017 6.0673 7.8000 23.5720 25.4842 39.4895
frequency: 22.7530 25.3052 39.4522 54.3524 64.9285 79.4862 105.7927 172.6080 183.4851 197.5092 267.6760 281.8230 318.6250 327.9588 373.6216 406.1934 466.4788 515.6498 531.4316 542.0864 594.4337 615.3674 708.5174 759.3547 765.2116 813.0264 864.7815 881.6035 924.9759 935.6682 974.6752 987.8053 989.9674 1012.6387 1027.0565 1036.2413 1041.7781 1093.6877 1173.2092 1176.1312 1190.1573 1197.8282 1242.8391 1264.5372 1336.3484 1368.7075 1383.7506 1442.4321 1451.5769 1482.9109 1590.4150 1598.7651 1612.6967 2908.0380 2961.8880 3010.7593 3090.9066 3112.1739 3118.6670 3134.5224 3148.2869 3165.7389 3469.6359
redmass: 5.3832 7.6913 7.3858 6.0797 4.3007 8.3241 8.3207 3.3222 2.1630 6.8399 3.1753 5.7696 2.8228 2.0626 7.5609 2.8828 3.4383 2.8015 14.3184 3.9509 13.2917 6.2126 1.9493 1.9285 2.6935 1.1154 1.2507 1.9983 5.6214 1.4321 1.7919 4.1402 1.4901 1.3667 2.2915 2.1505 1.2687 1.6208 1.2164 1.1995 2.1040 1.2557 1.1133 1.3147 1.2585 1.1931 8.2204 2.1849 1.1216 2.0718 6.4348 6.1632 6.2747 1.0757 1.0866 1.0591 1.1044 1.0921 1.0877 1.0895 1.0952 1.1012 1.0661
irintensity: 0.3789 0.4043 2.7348 0.8428 1.7334 1.0192 1.3588 8.9959 16.7069 44.7994 10.1109 24.4538 44.5802 99.9039 30.0753 0.1457 6.2495 44.7522 157.1209 4.5600 138.5062 0.3311 40.5770 36.0466 4.2887 116.7424 2.8251 5.8760 93.2108 14.4373 7.1543 1.8351 0.5644 2.6060 10.1366 15.6561 35.3355 11.8874 11.6354 11.2692 12.5502 4.6972 319.4752 18.4744 0.3370 0.7430 0.7511 7.4211 19.9477 22.3629 50.1189 144.5072 82.1263 1716.4980 48.4851 11.5025 3.5990 13.1296 7.3700 4.5529 23.2345 28.0264 28.0194
temp: 298.150 k
press: 1.00000 atm
elementType: 16 8 8 8 8 6 6 6 6 6 6 6 6 1 1 1 1 1 1 1 1 1 1
symmnumber: 1
zpe: 434465.3 jmol-1
zpe.correction: 0.165479 hartree
zpe.thermalcorrener: 0.180344 hartree
zpe.thermalcorrenthalpy: 0.181288 hartree
zpe.thermalcorrgfe: 0.119970 hartree
zpe.sumelectzpe: -1008.710098 hartree
zpe.sumelectthermal: -1008.695234 hartree
zpe.sumelectthermalent: -1008.694290 hartree
zpe.sumelectthermalfe: -1008.755607 hartree
dipole: 5.0106 2.3577 0.2807
dipole: 5.5447
quadrupole: -84.0914 -74.5101 -90.0174
quadrupole: -0.4434 -0.1435 -10.5454
quadrupole: -1.2185 8.3628 -7.1444 -0.4434 -0.1435 -10.5454
hfenergy: -1008.8755774 hartree
pointgroup: C01 [X(C8H10O4S1)]
dipole: 1.6756492 0.8974391 1.0703109 debye
dipolederiv: 1.3654192 0.3024135 0.4011816 0.3670185 1.3923187 -0.1052608 0.5769341 -0.1883865 1.0501795 -1.1422166 -0.2811909 0.0836996 -0.6633887 -0.4608708 0.0950722 -0.2646389 -0.1445234 -0.6762117 -0.4785069 0.0385947 -0.2374615 -0.3343645 -0.9988428 0.264526 -0.1233704 0.0780239 -0.3826318 -1.3049887 -0.4582168 -0.5330681 -0.2567373 -0.6694592 -0.1449219 -0.7308399 -0.3108361 -0.7066042 -0.4306225 -0.0083757 0.0488641 -0.0302432 -0.4391876 -0.0730025 -0.4265594 0.163747 -0.6689918 -0.2806945 -0.0302387 0.2271109 0.070198 0.0135981 -0.0209763 0.3420297 0.1160713 -0.2078941 1.1549047 0.3839142 -0.0809009 0.7461669 0.3343155 -0.2496806 -0.3665463 -0.1682855 0.8305512 0.2314137 -0.0464326 -0.099702 -0.2748107 0.0057911 0.1673115 -0.0073508 0.0825789 -0.0586021 -0.0508196 0.0041161 0.001204 0.0518096 -0.0102597 0.1068659 0.0833114 0.0966921 -0.1221507 -0.0414981 0.0432152 0.081647 0.0176478 -0.0968722 0.0348022 0.1030029 0.0290686 -0.1157459 0.0893454 0.0383897 0.061849 0.0882404 -0.0925252 0.0151256 0.0592047 0.039811 -0.1044962 -0.0948991 0.0034719 0.0237437 0.0159606 0.0256056 0.1214625 -0.0067353 0.1313439 -0.0152496 0.0131684 -0.0780017 -0.0285164 -0.0817912 -0.0310958 0.0859759 -0.0397328 0.0852035 -0.0964215 0.0638816 -0.0859194 -0.0409678 -0.0139865 -0.0569759 -0.052724 -0.018283 -0.0721934 0.0686076 0.0040034 0.0524937 -0.0386665 0.0355243 0.1029019 0.0000058 -0.0463186 0.0208886 0.0204459 -0.0391416 -0.1015218 -0.2063335 -0.1019534 0.0762777 0.0092944 -0.0929704 0.0005713 -0.1137317 0.0897248 0.0030789 -0.010213 -0.0324166 -0.0258161 -0.1227823 -0.0216499 -0.1274544 0.0502743 0.1170897 0.0198021 -0.0063226 -0.0253057 0.1076044 -0.021042 -0.0494367 -0.0437536 0.1089966 0.5523217 0.1192121 0.2094256 0.2385381 0.414915 0.1520347 0.8767944 0.4219537 0.7150787 -0.1139727 -0.0362017 -0.0483066 -0.0337735 0.0994168 -0.0515779 -0.0611901 -0.0442593 0.120166 0.0757187 -0.0241938 -0.0254235 0.0007309 -0.0053477 -0.130197 -0.0180104 -0.1235168 0.0521489 -0.0455623 0.0886272 0.0506828 0.0923512 0.0530618 -0.0708096 0.0579473 -0.0749934 0.1034713 0.2659312 0.0529637 0.1664742 0.1245848 0.2614464 -0.0095019 0.1744084 0.0322486 0.1488111 unknown
polarizability: 161.3526685|11.0003728|107.5754072|4.7284634|23.4414669|108.1373606 unknown
InChI: InChI=1S/C8H8O.H2O3S/c9-7-6-8-4-2-1-3-5-8;1-4(2)3/h1-5,7H,6H2;1-2H
charge 0 multiplicity 1
23 atoms
S  -3.907949 -0.907337 -0.88064
O  -1.387918 0.153621 1.961057
O  -3.897422 -2.624556 -0.185968
O  -2.196094 -0.415702 -0.495172
O  -3.841754 -1.024239 -2.479685
C  0.187391 1.582032 0.717664
C  -0.345349 0.868037 1.946757
C  1.365647 0.755759 0.181949
C  2.69839 1.049583 0.565513
C  1.108508 -0.344008 -0.678551
C  3.768553 0.263186 0.081765
C  2.181538 -1.125538 -1.160911
C  3.511723 -0.826447 -0.782098
H  0.528252 2.591842 1.009941
H  -0.609698 1.662143 -0.040463
H  0.266489 0.946327 2.873893
H  2.902143 1.901715 1.225959
H  0.074549 -0.569863 -0.971207
H  -2.060819 -0.250295 0.513846
H  4.797197 0.502112 0.373652
H  1.97951 -1.965646 -1.834493
H  4.340956 -1.434857 -1.15976
H  -3.309741 -3.195968 -0.762347
