program: Gaussian 09
title: 000242664
version: EM64L-G09RevD.01
frameworkgroup: C1[X(C15H15NO4)]
method: RPBEPBE
basis: SDD
operation: Freq
keyword: #p
keyword: freq=noraman
keyword: PBEPBE/SDD
title: #p freq=noraman PBEPBE/SDD
converged: YES YES NO NO
title: Mulliken charges:
elementType: O O O O N C C C C C C C C C C C C C C C H H H H H H H H H H H H H H H
charge: -0.270381 -0.263952 -0.443239 -0.264162 -0.126729 -0.406671 -0.563966 0.528394 -0.278807 0.187122 -0.525610 -0.444540 0.220359 0.340856 -0.316258 -0.223394 -0.214137 -0.378675 0.109588 -0.536841 0.282066 0.234726 0.260561 0.218975 0.292826 0.273714 0.233887 0.254274 0.280804 0.222053 0.243438 0.220145 0.220943 0.246436 0.386196
chargesum: 0.00000
title: Mulliken charges with hydrogens summed into heavy atoms:
elementType: O O O O N C C C C C C C C C C C C C C C
charge: -0.270381 -0.263952 -0.057043 -0.264162 -0.126729 0.110122 -0.084430 0.528394 0.014019 0.187122 -0.251897 -0.210653 0.220359 0.340856 -0.061984 0.057410 0.007915 -0.135237 0.109588 0.150684
polarizability: 2.86026923e+02 2.31718046e+01 1.96928643e+02 -1.60210288e+01 5.54190784e+00 9.12818177e+01
1716.lowfreq: -8.3791 -3.4937 -0.0010 -0.0009 -0.0007 5.5207 16.0772 20.4879 40.6479
frequency: 16.0343 20.4280 40.6309 54.1148 67.9902 94.8925 102.7659 111.6279 166.4931 199.9425 206.1173 216.5968 253.8305 265.6010 307.9492 316.8621 332.7045 357.8744 416.5270 436.4272 449.8192 461.6935 506.3192 518.9234 546.3227 557.0275 573.0061 584.8335 596.4121 629.7656 689.7890 701.0576 701.8086 731.2151 741.6050 753.3652 783.9908 801.0941 843.4135 873.6784 888.8225 898.7587 916.4670 939.7376 966.3770 980.5289 995.1547 995.5945 1017.1957 1024.0562 1045.0961 1083.2357 1100.1008 1111.9214 1114.7528 1145.5079 1165.0594 1169.7600 1185.7965 1187.3388 1221.7171 1254.1639 1272.0173 1293.4154 1306.4440 1326.5621 1327.8624 1353.3405 1389.2833 1404.5842 1430.2312 1433.0544 1448.6703 1457.3909 1467.6777 1474.6237 1477.7205 1480.7725 1545.5823 1582.1192 1589.1464 1620.3177 1633.6367 1659.9746 2959.2185 3002.8978 3030.5552 3046.6439 3064.6414 3105.0913 3123.0687 3125.8617 3143.4458 3147.5069 3156.9902 3167.0921 3168.0576 3190.2807 3536.7727
redmass: 5.7565 5.6736 4.6438 4.6533 5.6797 4.2476 6.9481 5.3994 5.2911 2.0098 3.6922 2.9048 4.5860 1.7273 2.9262 3.5842 5.3405 4.3143 5.5397 4.2895 4.5330 3.2007 2.7181 6.3409 4.3514 4.6056 4.1576 3.1130 1.5698 5.7892 3.9945 3.5795 3.2995 4.2480 3.5505 4.3418 1.5200 1.4474 1.5951 1.5064 3.6888 1.8803 3.1205 1.4789 1.3249 5.2001 2.2960 1.4865 3.4595 4.6374 2.2249 2.2608 1.6851 1.2600 2.1407 1.5352 1.4213 1.4616 1.3047 1.5792 1.5966 2.6519 1.3677 1.3600 1.3795 2.0268 1.5710 1.3666 8.2185 2.5654 3.1854 1.3248 2.1862 1.1761 1.0503 1.1005 1.9663 1.2331 7.5328 6.0325 6.1638 6.6430 8.1092 7.8736 1.0330 1.0601 1.0604 1.1039 1.1008 1.1063 1.0868 1.0992 1.0927 1.0926 1.0937 1.0965 1.0886 1.0979 1.0642
irintensity: 0.0361 0.3100 1.9349 0.7796 0.1181 3.1748 8.2154 0.6183 3.1031 0.1648 3.5166 3.7294 3.2377 2.1612 1.5448 1.8603 0.6106 3.5127 21.7092 0.9942 6.8064 14.1613 30.1828 8.8800 5.8610 22.7934 40.5117 26.8340 88.4371 5.4079 18.6437 39.2360 5.4985 13.1353 31.8901 5.1716 39.3516 5.6745 41.7136 0.9851 7.6138 12.2467 16.4270 10.6971 0.5228 11.0288 125.7534 36.2134 30.5551 19.1127 250.0642 54.3189 43.9785 0.2491 65.1759 23.7619 10.6892 159.7337 4.9228 5.0739 3.3317 137.0956 1.1667 13.2746 1.6222 58.1751 140.2041 2.6949 7.5544 1.6757 17.0094 21.8788 26.1283 5.1445 13.4480 25.0485 50.6281 16.8684 55.1634 111.3170 48.1798 140.6893 512.6214 253.6253 72.0138 17.5054 23.4281 49.9543 4.4514 3.4388 5.7694 25.1484 19.0974 2.6561 0.2070 16.6089 0.1725 3.1211 62.3524
temp: 298.150 k
press: 1.00000 atm
elementType: 8 8 8 8 7 6 6 6 6 6 6 6 6 6 6 6 6 6 6 6 1 1 1 1 1 1 1 1 1 1 1 1 1 1 1
symmnumber: 1
zpe: 714052.4 jmol-1
zpe.correction: 0.271968 hartree
zpe.thermalcorrener: 0.290319 hartree
zpe.thermalcorrenthalpy: 0.291263 hartree
zpe.thermalcorrgfe: 0.222646 hartree
zpe.sumelectzpe: -934.808330 hartree
zpe.sumelectthermal: -934.789980 hartree
zpe.sumelectthermalent: -934.789035 hartree
zpe.sumelectthermalfe: -934.857652 hartree
dipole: 1.1217 -2.1906 -0.3647
dipole: 2.4880
quadrupole: -79.7282 -126.1377 -119.1842
quadrupole: -8.3333 -6.5170 -0.9401
quadrupole: 28.6219 -17.7877 -10.8342 -8.3333 -6.5170 -0.9401
hfenergy: -935.0802981 hartree
pointgroup: C01 [X(C15H15N1O4)]
dipole: -0.4565913 -0.8441673 0.1924162 debye
polarizability: 285.4238081|-25.4789286|196.6719606|-13.337247|-11.8847642|92.1416151 unknown
InChI: InChI=1S/C15H15NO4/c1-20-13-4-2-3-11(9-13)7-8-16-10-12(15(18)19)5-6-14(16)17/h2-6,9-10,18H,7-8H2,1H3
charge 0 multiplicity 1
35 atoms
O  -5.25108 1.230561 0.170522
O  0.79121 2.641386 -0.19896
O  6.147097 -0.777789 0.042388
O  4.617144 -2.418499 0.663179
N  1.511575 0.457412 0.313687
C  0.091679 0.086747 0.559251
C  -0.655098 -0.25043 -0.760784
C  -2.110119 -0.597428 -0.481862
C  2.506332 -0.473634 0.426383
C  1.766055 1.834767 -0.0942
C  -3.056951 0.432625 -0.290557
C  -2.526737 -1.951539 -0.369257
C  3.843435 -0.158641 0.170749
C  -4.406413 0.121512 0.007663
C  3.167718 2.139229 -0.342545
C  4.166396 1.188247 -0.221627
C  -3.871476 -2.255372 -0.072535
C  -4.824356 -1.228303 0.119801
C  4.844736 -1.22819 0.323995
C  -6.661593 0.972423 0.468428
H  -0.397264 0.950468 1.038997
H  0.068508 -0.773515 1.250724
H  -0.586884 0.630295 -1.423796
H  -0.146042 -1.09604 -1.260354
H  2.224681 -1.4866 0.731328
H  -2.769988 1.486581 -0.377453
H  -1.802133 -2.759496 -0.524747
H  3.384158 3.169118 -0.637672
H  5.211906 1.440552 -0.419528
H  -4.190048 -3.300942 0.006951
H  -5.863246 -1.485605 0.346098
H  -6.779175 0.426478 1.424943
H  -7.148248 0.401768 -0.346561
H  -7.12324 1.967235 0.550893
H  6.777461 -1.537481 0.161262
