program: Gaussian 09
title: 000242662
version: EM64L-G09RevD.01
frameworkgroup: C1[X(C16H20N6S)]
method: RPBEPBE
basis: SDD
operation: Freq
keyword: #p
keyword: freq=noraman
keyword: PBEPBE/SDD
title: #p freq=noraman PBEPBE/SDD
converged: YES YES NO NO
title: Mulliken charges:
elementType: S N N N N N N C C C C C C C C C C C C C C C C H H H H H H H H H H H H H H H H H H H H
charge: 0.282390 -0.167923 -0.048070 -0.063810 -0.089590 -0.592789 -0.029913 -0.013885 -0.410371 -0.360569 -0.729232 0.159782 -0.705745 -0.246201 0.082714 -0.322423 -0.050190 -0.799428 0.224320 -0.294320 -0.180107 -0.355623 -0.176299 0.236216 0.238097 0.207303 0.222988 0.183848 0.217854 0.204906 0.228931 0.214264 0.220552 0.214745 0.271141 0.298220 0.294057 0.328397 0.328278 0.271728 0.236106 0.239796 0.229853
chargesum: 0.00000
title: Mulliken charges with hydrogens summed into heavy atoms:
elementType: S N N N N N N C C C C C C C C C C C C C C C C
charge: 0.282390 -0.167923 -0.048070 -0.063810 -0.089590 0.063887 -0.029913 0.222331 0.035028 0.046267 -0.077541 0.159782 -0.056185 0.024940 0.082714 -0.322423 -0.050190 -0.207151 0.224320 -0.022592 0.056000 -0.115827 0.053554
polarizability: 3.48573513e+02 5.76059590e+00 2.19472291e+02 -1.68595129e+01 1.23540411e+00 1.62426252e+02
1716.lowfreq: -14.4364 -7.7911 -0.5084 -0.0018 -0.0010 0.0008 9.7834 14.9915 27.9587
frequency: 6.2404 14.8422 27.6648 28.6044 36.9284 53.6830 77.6828 103.8678 120.9792 126.9044 155.3509 174.7363 188.2524 194.8130 206.0783 236.9527 247.3415 262.7376 285.3571 305.3619 341.0812 346.7198 369.5798 402.9786 403.5121 410.4891 435.0712 471.1383 474.1586 507.1669 511.0360 549.2737 571.2605 589.2447 619.9681 632.7908 645.3056 646.6852 712.1427 737.1963 753.9788 759.7612 778.5489 793.2505 795.2491 800.3763 813.5413 819.9710 872.2852 878.3605 897.4678 907.8014 921.9108 961.4472 962.5505 966.5183 967.7281 991.5447 1005.4767 1038.3220 1039.0149 1050.8679 1081.1996 1082.8000 1121.4824 1141.9079 1158.4051 1161.9423 1168.1338 1192.1246 1196.7686 1240.1735 1258.6981 1267.2128 1285.2097 1289.3627 1296.8132 1306.8843 1317.3560 1324.0563 1325.7374 1341.4222 1350.4226 1360.1950 1379.0487 1381.7729 1390.0480 1413.6125 1418.5119 1431.0098 1454.9313 1457.4926 1464.9884 1473.9775 1479.3509 1484.3536 1487.6290 1498.4382 1519.0070 1562.2913 1570.2796 1581.3744 1606.1031 2956.5268 2970.2651 2977.9760 2986.4519 3000.1201 3020.0825 3040.3360 3058.4705 3066.3465 3072.5051 3075.3873 3083.1104 3126.5238 3135.2257 3136.3333 3153.4944 3168.5244 3227.6672 3565.6108 3723.9597
redmass: 5.1240 4.1784 4.8948 4.7355 4.8662 2.3731 2.6238 4.7838 6.8900 4.8843 5.3842 5.6941 3.8187 1.1187 1.6055 2.5914 2.5678 3.6992 2.8086 3.9006 3.7431 2.3207 4.9304 2.1192 3.4385 6.7583 1.1937 4.0696 3.0525 1.1415 4.5747 4.9451 5.0152 8.0460 6.8189 4.7654 5.5606 5.0398 11.2418 4.6563 1.7173 1.7302 4.5503 2.4687 1.6338 6.2908 1.7319 4.1557 3.1024 2.6572 1.7937 1.3215 1.6605 4.2349 1.8280 3.6034 1.2178 1.7447 1.3356 2.2640 2.3013 3.0339 1.7003 2.1027 4.1636 2.1643 2.0346 1.0798 1.1261 2.1978 1.9292 2.0843 1.4693 1.3376 2.8353 1.6506 1.8537 3.1037 1.4450 2.6125 2.3974 2.3042 1.5281 1.6880 4.5210 1.2724 1.2078 1.8306 1.1994 2.7765 2.1940 1.3252 1.0889 1.0464 1.0722 1.0585 1.0503 3.0458 8.3293 5.8800 9.6148 5.6471 1.5026 1.0628 1.0376 1.0362 1.0792 1.0622 1.0980 1.0596 1.1011 1.1024 1.0997 1.0997 1.0982 1.0875 1.1018 1.0931 1.0952 1.1017 1.0981 1.0441 1.1059
irintensity: 0.1532 0.3109 0.0629 0.8991 0.3600 0.0582 0.4149 2.9669 0.8638 1.2223 5.7391 0.4911 1.0365 0.0589 0.1842 1.4070 1.3724 1.6378 0.1806 2.9032 15.1269 9.9697 0.3965 0.5982 5.3784 0.7587 281.4918 4.1239 0.8076 4.6321 4.2234 4.5872 13.0325 0.6000 2.1608 14.7127 15.0815 19.6823 6.9832 17.0090 33.7709 3.0934 18.9438 20.4186 3.2780 2.0878 7.9549 5.2342 71.2416 48.8109 10.7635 0.1263 7.4778 7.9604 1.5366 12.9715 9.0248 7.9620 0.0796 7.6645 4.7370 0.9381 4.9216 2.7042 83.3882 0.4909 5.2998 0.5616 2.9706 2.1019 55.9901 4.3887 4.1692 12.4746 13.3841 9.6591 0.7605 59.0445 14.3789 1.9782 5.5097 15.9271 5.4493 25.8589 84.1798 11.1391 13.5000 26.7052 10.4371 48.9864 63.7655 34.6551 10.3397 10.5549 11.6321 17.8222 5.0656 193.7158 320.9301 13.3531 215.8057 38.9367 391.9980 25.7788 31.7164 35.2348 2.3472 41.7919 31.6889 17.2320 7.4156 27.3667 72.0477 47.9637 36.3591 13.4236 3.4442 15.4108 13.1750 31.3467 0.1522 108.5988 43.2538
temp: 298.150 k
press: 1.00000 atm
elementType: 16 7 7 7 7 7 7 6 6 6 6 6 6 6 6 6 6 6 6 6 6 6 6 1 1 1 1 1 1 1 1 1 1 1 1 1 1 1 1 1 1 1 1
symmnumber: 1
zpe: 902430.5 jmol-1
zpe.correction: 0.343718 hartree
zpe.thermalcorrener: 0.366181 hartree
zpe.thermalcorrenthalpy: 0.367126 hartree
zpe.thermalcorrgfe: 0.287460 hartree
zpe.sumelectzpe: -1346.609637 hartree
zpe.sumelectthermal: -1346.587173 hartree
zpe.sumelectthermalent: -1346.586229 hartree
zpe.sumelectthermalfe: -1346.665894 hartree
dipole: 3.2543 5.2599 -0.8665
dipole: 6.2456
quadrupole: -120.8376 -141.4273 -139.8488
quadrupole: -12.0517 1.5616 1.8815
quadrupole: 13.2003 -7.3894 -5.8109 -12.0517 1.5616 1.8815
hfenergy: -1346.9533542 hartree
pointgroup: C01 [X(C16H20N6S1)]
dipole: 1.3499968 1.8662208 -0.8559449 debye
polarizability: 347.9543709|-4.3171826|216.7394102|-20.6360606|-11.6651813|165.7782756 unknown
InChI: InChI=1S/C16H20N6S/c1-3-11(2)8-22-10-19-13-14(22)20-16(17)21-15(13)23-9-12-6-4-5-7-18-12/h4-7,10-11H,3,8-9,17H2,1-2H3
charge 0 multiplicity 1
43 atoms
S  -1.912717 -1.720901 1.112932
N  2.689789 -0.993137 -0.812722
N  1.039928 -2.487185 -0.217931
N  1.574262 1.122197 -0.188141
N  -0.680556 0.730979 0.724782
N  0.194787 2.89265 0.503866
N  -5.492121 -0.706648 1.036387
C  4.940967 -0.045273 -0.137952
C  3.98324 -0.470105 -1.285858
C  5.322423 -1.253973 0.755869
C  6.178108 0.645727 -0.757788
C  1.637464 -0.229724 -0.309029
C  6.121378 -0.871985 2.020928
C  2.271615 -2.337665 -0.730105
C  0.619541 -1.170532 0.052515
C  -0.568451 -0.614798 0.593746
C  0.377664 1.536343 0.339241
C  -3.175837 -0.455307 1.786633
C  -4.268246 -0.137542 0.795744
C  -4.031381 0.713276 -0.317028
C  -5.089543 0.982607 -1.209796
C  -6.504935 -0.435918 0.161448
C  -6.355253 0.396043 -0.970686
H  4.398343 0.695608 0.484021
H  3.776759 0.400807 -1.934339
H  4.458155 -1.255679 -1.904037
H  4.397241 -1.777636 1.068208
H  5.907858 -1.978823 0.150672
H  5.883512 1.506376 -1.387269
H  6.751735 -0.060217 -1.390087
H  6.858323 1.023707 0.024764
H  5.569301 -0.127256 2.624812
H  6.295793 -1.757812 2.65836
H  7.108509 -0.442392 1.772497
H  2.90984 -3.15319 -1.064851
H  -2.574145 0.431737 2.04273
H  -3.601158 -0.930844 2.681891
H  0.942829 3.527918 0.241316
H  -0.6694 3.231844 0.915687
H  -3.0317 1.135447 -0.461805
H  -4.932833 1.634937 -2.075871
H  -7.467678 -0.909136 0.387758
H  -7.20291 0.575776 -1.639711
