program: Gaussian 09
title: 000242660
version: EM64L-G09RevD.01
frameworkgroup: C1[X(C11H15N5O2S)]
method: RPBEPBE
basis: SDD
operation: Freq
keyword: #p
keyword: freq=noraman
keyword: PBEPBE/SDD
title: #p freq=noraman PBEPBE/SDD
converged: YES YES NO NO
title: Mulliken charges:
elementType: S O O N N N N N C C C C C C C C C C C H H H H H H H H H H H H H H H
charge: 0.321377 -0.417324 -0.214085 -0.169349 -0.049128 -0.066962 -0.064582 -0.590407 -0.382583 -0.350435 -0.338163 0.169333 0.086522 -0.238518 -0.692477 -0.334112 -0.048794 -0.695273 0.217401 0.212855 0.240324 0.204697 0.226312 0.194458 0.200465 0.265884 0.219323 0.215412 0.213350 0.311624 0.310924 0.328799 0.329396 0.383735
chargesum: 0.00000
title: Mulliken charges with hydrogens summed into heavy atoms:
elementType: S O O N N N N N C C C C C C C C C C C
charge: 0.321377 -0.033590 -0.214085 -0.169349 -0.049128 -0.066962 -0.064582 0.067789 0.070596 0.080574 0.056761 0.169333 0.086522 0.027366 -0.044393 -0.334112 -0.048794 -0.072725 0.217401
polarizability: 2.68240189e+02 -1.00303484e+01 1.95415912e+02 -1.26933654e+01 -1.39052499e+00 9.81381667e+01
1716.lowfreq: -4.7529 -0.0023 -0.0005 0.0015 2.3791 5.5483 17.4787 21.4888 22.4298
frequency: 17.3489 21.2706 22.4183 44.7095 55.2505 71.7889 82.6952 104.8066 114.9904 157.2351 169.1027 175.8501 199.4743 209.0300 238.0844 251.5267 301.3889 342.2370 357.5540 379.0441 421.4727 430.8849 438.4388 496.2029 506.8219 510.8360 549.9289 567.2846 591.4457 628.7433 632.5761 644.2922 714.4023 727.2478 735.9688 749.2831 781.1095 789.9045 799.0138 814.1170 873.9843 880.8305 897.6359 902.9403 926.6726 960.3476 1014.8983 1038.1277 1045.7821 1074.9744 1078.7061 1114.8948 1125.7639 1136.8555 1194.9092 1199.0917 1225.3133 1257.1677 1271.3327 1287.5934 1291.0937 1306.7202 1318.0126 1326.4839 1342.8332 1349.7910 1361.4313 1379.5119 1393.9684 1408.7390 1434.0424 1462.8719 1469.6675 1477.9497 1478.8783 1488.3154 1500.6101 1522.8332 1573.9333 1606.3300 1674.3249 2967.0627 2977.6218 2985.2285 3006.7510 3011.6258 3044.2040 3051.1012 3072.5281 3077.0311 3078.4134 3113.4384 3227.2681 3516.3898 3567.2498 3726.0382
redmass: 4.1035 5.6331 9.3381 4.8287 1.9633 4.0163 3.0166 2.3080 6.2889 5.4559 6.6052 6.3092 4.9812 2.4408 1.3041 4.3623 4.9767 4.3476 5.1685 6.4295 9.1864 3.5344 1.2193 1.7651 5.0015 1.1304 5.2267 4.9086 7.9188 1.3618 5.1362 5.0389 11.1785 4.8077 1.1393 6.4819 4.3247 1.3123 6.4539 1.7658 5.1795 8.6298 1.7994 1.7399 1.2564 5.1058 3.8705 2.3441 2.1956 2.4309 2.0779 2.3448 4.0329 1.1378 2.0377 1.8548 1.3455 1.5797 1.2903 3.2768 1.0810 4.6912 2.4364 2.3150 1.6898 1.9517 1.5590 6.3678 1.2136 1.0867 3.0943 1.2678 1.0722 1.0772 1.0421 1.0952 2.8644 8.5137 9.6780 1.5265 8.8129 1.0590 1.0363 1.0605 1.0621 1.0965 1.1020 1.0585 1.1027 1.0995 1.1038 1.1032 1.0981 1.0640 1.0441 1.1059
irintensity: 0.2371 0.1490 1.0569 0.0705 0.4891 1.2770 3.3068 0.0564 0.1137 6.2981 1.2254 4.3727 0.3074 0.6730 0.2835 0.2214 1.7146 7.7408 3.2207 8.8964 7.1506 2.7845 296.0751 27.3593 3.0297 3.8194 1.0918 61.5912 0.2152 144.5117 7.6695 16.2017 6.1694 18.6886 7.8465 16.2207 19.7873 0.3768 1.4659 8.6838 22.3293 90.6299 9.2101 7.2381 4.7403 23.8333 2.9023 9.4159 355.2772 0.1271 0.0834 13.3109 58.1210 0.0207 26.3220 32.1988 0.0824 13.0505 1.2242 18.7711 1.1213 77.9414 40.2548 32.2671 9.0259 4.2325 36.5877 54.7143 10.5437 60.9480 63.8564 25.4603 0.8702 6.7781 13.7743 15.0128 187.8913 280.3431 238.4774 417.5272 185.6701 30.1457 32.3534 22.3177 50.2945 10.4580 8.9696 12.5890 8.5905 51.7779 78.0949 0.4078 0.0877 28.4254 115.6470 43.9367
temp: 298.150 k
press: 1.00000 atm
elementType: 16 8 8 7 7 7 7 7 6 6 6 6 6 6 6 6 6 6 6 1 1 1 1 1 1 1 1 1 1 1 1 1 1 1
symmnumber: 1
zpe: 687517.2 jmol-1
zpe.correction: 0.261861 hartree
zpe.thermalcorrener: 0.281412 hartree
zpe.thermalcorrenthalpy: 0.282357 hartree
zpe.thermalcorrgfe: 0.210010 hartree
zpe.sumelectzpe: -1249.043848 hartree
zpe.sumelectthermal: -1249.024297 hartree
zpe.sumelectthermalent: -1249.023353 hartree
zpe.sumelectthermalfe: -1249.095699 hartree
dipole: 3.8031 4.5757 -0.4034
dipole: 5.9635
quadrupole: -93.9514 -116.7065 -120.0248
quadrupole: -18.1542 -2.8076 0.9223
quadrupole: 16.2762 -6.4789 -9.7972 -18.1542 -2.8076 0.9223
hfenergy: -1249.3057092 hartree
pointgroup: C01 [X(C11H15N5O2S1)]
dipole: -1.4884005 -1.8135537 0.0197979 debye
polarizability: 268.5778589|-8.6063461|194.7998832|11.8146289|-7.2256735|98.4165255 unknown
InChI: InChI=1S/C11H15N5O2S/c1-2-3-4-16-6-13-8-9(16)14-11(12)15-10(8)19-5-7(17)18/h6,17H,2-5,12H2,1H3
charge 0 multiplicity 1
34 atoms
S  2.786761 1.14932 -0.01242
O  6.271276 -0.847987 0.538086
O  5.779402 1.416565 0.341626
N  -2.200872 0.858212 -0.702943
N  -0.33978 2.200076 -0.500288
N  -1.141123 -1.358235 -0.43349
N  1.295848 -1.175876 -0.103225
N  0.217431 -3.253808 -0.153819
C  -3.611901 0.454915 -0.836073
C  -4.330719 0.320814 0.525949
C  -5.802476 -0.118346 0.357345
C  -1.122708 -0.002077 -0.49781
C  0.025256 0.845502 -0.378767
C  -1.668973 2.163675 -0.688411
C  -6.533558 -0.261841 1.709649
C  1.259002 0.178204 -0.174388
C  0.110734 -1.882843 -0.234552
C  3.978984 -0.291474 0.214008
C  5.390393 0.231834 0.362412
H  -4.12445 1.200527 -1.472207
H  -3.629101 -0.514823 -1.365611
H  -4.287277 1.288637 1.063892
H  -3.787951 -0.418704 1.145199
H  -6.338849 0.617154 -0.276828
H  -5.836059 -1.084495 -0.186052
H  -2.300782 3.038781 -0.828383
H  -7.582055 -0.581273 1.56838
H  -6.034748 -1.011636 2.35161
H  -6.543591 0.697553 2.259886
H  3.906348 -0.966944 -0.652931
H  3.687569 -0.874646 1.101644
H  -0.619059 -3.82264 -0.246044
H  1.13125 -3.671836 -0.007297
H  7.198977 -0.498986 0.634251
