program: Gaussian 09
title: 000242656
version: EM64L-G09RevD.01
frameworkgroup: C1[X(C14H16N6S)]
method: RPBEPBE
basis: SDD
operation: Freq
keyword: #p
keyword: freq=noraman
keyword: PBEPBE/SDD
title: #p freq=noraman PBEPBE/SDD
converged: YES YES NO NO
title: Mulliken charges:
elementType: S N N N N N N C C C C C C C C C C C C C C H H H H H H H H H H H H H H H H
charge: 0.283366 -0.174093 -0.047473 -0.065368 -0.090003 -0.592751 -0.030218 -0.347651 0.165193 -0.355832 0.085522 -0.241032 -0.321442 -0.677589 -0.046240 -0.799123 0.223221 -0.293885 -0.180636 -0.355684 -0.176152 0.238001 0.209283 0.234718 0.211369 0.265492 0.215421 0.226843 0.209417 0.294069 0.297692 0.328383 0.328339 0.273220 0.236053 0.239778 0.229791
chargesum: 0.00000
title: Mulliken charges with hydrogens summed into heavy atoms:
elementType: S N N N N N N C C C C C C C C C C C C C C
charge: 0.283366 -0.174093 -0.047473 -0.065368 -0.090003 0.063971 -0.030218 0.099632 0.165193 0.090255 0.085522 0.024460 -0.321442 -0.025907 -0.046240 -0.207362 0.223221 -0.020665 0.055418 -0.115906 0.053639
polarizability: 3.23512639e+02 1.13927010e+00 2.01173437e+02 1.18101970e+01 2.70531780e+00 1.38488301e+02
1716.lowfreq: -13.8910 -4.6394 -4.0865 -0.0001 0.0006 0.0018 12.8904 15.7278 29.3600
frequency: 8.8479 15.4147 29.2928 35.7859 45.0330 64.6528 108.4360 124.1083 126.3000 165.7355 175.6718 207.3445 220.4328 224.4175 260.0525 289.0770 315.7918 341.0559 348.9543 398.9763 403.7187 410.4067 435.9770 470.8104 507.6842 509.0207 552.2886 571.6166 590.1470 620.2029 633.0450 644.5590 647.2757 712.6250 729.7372 748.8150 754.9264 779.2253 793.4401 798.2984 813.1666 820.2747 866.9882 873.8871 882.4755 893.0504 909.1795 961.6783 963.2202 966.8935 1006.5379 1034.7264 1039.2830 1050.6778 1072.6476 1081.5580 1112.2288 1123.0070 1161.9992 1169.0879 1195.4524 1206.8371 1240.5237 1258.2063 1272.7969 1287.0373 1297.0866 1300.0064 1307.6145 1323.3956 1325.7706 1344.2069 1357.6817 1379.0548 1393.3186 1413.7909 1418.2791 1433.8645 1455.4233 1463.4434 1475.7850 1478.8495 1486.8336 1499.6105 1519.5616 1562.2727 1571.2319 1581.6995 1606.4194 2977.4350 2993.8413 3007.0974 3039.1509 3041.2511 3065.7629 3082.6753 3083.9276 3126.6452 3134.2215 3136.8422 3154.2193 3168.5980 3227.1029 3566.7626 3725.1416
redmass: 3.0854 4.9839 4.8437 4.2498 5.3513 1.8444 6.5737 5.9470 5.5555 5.9713 5.7248 2.3050 1.8733 2.3130 4.5525 3.2577 4.9796 3.7838 2.2737 6.3073 3.5646 7.1436 1.1949 4.0591 1.4953 2.3871 5.0550 4.9955 8.0015 6.8060 4.7490 5.3842 5.0624 11.1944 4.2888 1.1783 1.7284 4.3905 2.4972 7.6511 1.7895 4.2057 1.5332 2.0786 2.9192 2.0172 1.3191 4.7864 1.8187 3.5955 1.3327 2.3732 2.3140 2.8758 1.9986 1.6315 2.2034 4.3252 1.0812 1.1236 2.0313 1.9319 2.0578 1.4806 1.3925 3.0455 1.8655 1.3780 3.5060 2.9143 2.7745 2.5224 1.5108 6.6144 1.2088 1.8202 1.2045 3.1461 2.2499 1.2684 1.0520 1.0437 1.0992 2.9207 8.2930 5.8787 9.6534 5.6476 1.5058 1.0363 1.0606 1.0599 1.0597 1.0999 1.1025 1.1033 1.1001 1.0875 1.1046 1.0903 1.0950 1.1017 1.0981 1.0441 1.1059
irintensity: 0.0500 0.2304 1.0422 0.3347 0.3918 0.0853 3.0824 1.7648 0.1172 6.7075 0.7581 1.0526 0.2148 0.7966 3.0830 0.4151 4.2617 13.5267 10.5539 0.2380 5.8016 1.0313 284.7399 4.0690 4.4615 3.3979 3.5682 12.8897 0.6083 2.0719 11.9990 12.1268 24.1448 6.9176 14.7753 7.3785 34.4459 18.9802 20.1871 3.7426 8.0131 5.2145 22.4262 27.8657 71.6624 10.6831 0.1198 5.7399 2.5523 13.5745 0.1159 6.7406 5.6479 0.9830 4.7371 6.0326 9.8306 69.1253 0.5631 2.5202 40.3028 22.4174 4.1932 3.1947 6.2483 15.5928 1.3031 9.5772 68.0972 0.9528 1.7240 9.7654 32.0938 78.0280 13.6112 26.9549 10.6913 57.6561 66.1140 25.8321 2.9902 11.5389 23.0559 197.0355 311.8909 13.0536 217.3504 38.8949 393.5214 38.2290 6.8921 57.8433 16.4262 0.4309 6.0796 50.9807 44.1454 12.8781 4.3911 14.7008 12.9052 30.8449 0.1212 109.4443 43.5633
temp: 298.150 k
press: 1.00000 atm
elementType: 16 7 7 7 7 7 7 6 6 6 6 6 6 6 6 6 6 6 6 6 6 1 1 1 1 1 1 1 1 1 1 1 1 1 1 1 1
symmnumber: 1
zpe: 757287.0 jmol-1
zpe.correction: 0.288435 hartree
zpe.thermalcorrener: 0.308131 hartree
zpe.thermalcorrenthalpy: 0.309075 hartree
zpe.thermalcorrgfe: 0.235899 hartree
zpe.sumelectzpe: -1268.162677 hartree
zpe.sumelectthermal: -1268.142981 hartree
zpe.sumelectthermalent: -1268.142037 hartree
zpe.sumelectthermalfe: -1268.215214 hartree
dipole: 3.5773 5.0528 1.4681
dipole: 6.3626
quadrupole: -104.0287 -127.9090 -127.4601
quadrupole: -9.5648 -3.4969 -2.2154
quadrupole: 15.7706 -8.1097 -7.6609 -9.5648 -3.4969 -2.2154
hfenergy: -1268.4511127 hartree
pointgroup: C01 [X(C14H16N6S1)]
dipole: -1.4502441 -1.1807075 1.6640169 debye
polarizability: 322.1755869|-14.0432622|177.4628345|-13.7003836|-30.0198364|163.5359558 unknown
InChI: InChI=1S/C14H16N6S/c1-2-7-20-9-17-11-12(20)18-14(15)19-13(11)21-8-10-5-3-4-6-16-10/h3-6,9H,2,7-8,15H2,1H3
charge 0 multiplicity 1
37 atoms
S  1.43419 0.899369 -1.904529
N  -3.257042 1.171609 -0.07803
N  -1.573022 2.184467 -1.279447
N  -2.13423 -0.953249 0.496414
N  0.16194 -1.042317 -0.392189
N  -0.742484 -2.812244 0.847779
N  4.993935 0.08591 -1.164389
C  -4.581052 0.933643 0.522747
C  -2.189842 0.274319 -0.08244
C  -5.531362 0.152559 -0.414225
C  -1.150236 0.919178 -0.827531
C  -2.828038 2.29427 -0.815795
C  0.056172 0.184745 -0.961537
C  -6.90667 -0.081849 0.244655
C  -0.919608 -1.559712 0.300341
C  2.709716 -0.519363 -1.803625
C  3.749941 -0.296677 -0.733446
C  3.446565 -0.485343 0.641544
C  4.45769 -0.270563 1.600964
C  5.960655 0.290437 -0.221893
C  5.743928 0.127645 1.164749
H  -4.42608 0.364774 1.457352
H  -5.019343 1.913792 0.788147
H  -5.060808 -0.815433 -0.667992
H  -5.652271 0.712853 -1.361322
H  -3.474495 3.156263 -0.969833
H  -6.807231 -0.662933 1.180518
H  -7.575874 -0.644277 -0.430093
H  -7.404883 0.87486 0.491251
H  3.183913 -0.541892 -2.795219
H  2.109542 -1.424898 -1.61794
H  -1.507652 -3.24021 1.360813
H  0.134661 -3.301466 0.697498
H  2.432922 -0.785687 0.925666
H  4.249361 -0.408578 2.667587
H  6.941421 0.595582 -0.605305
H  6.556772 0.308116 1.875452
