program: Gaussian 09
title: 000242654
version: EM64L-G09RevD.01
frameworkgroup: C1[X(C10H16N4O)]
method: RPBEPBE
basis: SDD
operation: Freq
keyword: #p
keyword: freq=noraman
keyword: PBEPBE/SDD
title: #p freq=noraman PBEPBE/SDD
converged: YES YES NO NO
title: Mulliken charges:
elementType: O N N N N C C C C C C C C C C H H H H H H H H H H H H H H H H
charge: -0.260073 -0.435704 -0.462542 -0.042303 -0.632579 -0.066216 -0.404735 -0.472147 -0.391029 -0.412496 -0.379273 0.489630 -0.500995 0.152762 0.038040 0.191054 0.214880 0.196411 0.206244 0.226871 0.213099 0.207676 0.215672 0.191277 0.193970 0.210878 0.313369 0.310426 0.234984 0.301434 0.351414
chargesum: 0.00000
title: Mulliken charges with hydrogens summed into heavy atoms:
elementType: O N N N N C C C C C C C C C C
charge: -0.260073 -0.122335 -0.152116 -0.042303 0.020268 0.124837 0.006556 -0.039032 0.029746 -0.005547 0.025576 0.489630 -0.266010 0.152762 0.038040
polarizability: 1.81054925e+02 1.05079022e+01 1.48072274e+02 -1.07536829e+01 -3.49100711e+00 9.36822751e+01
1716.lowfreq: -17.4599 -10.2195 -0.0009 -0.0008 -0.0005 9.9379 19.0060 43.1328 80.2360
frequency: 14.0068 42.9081 80.1453 113.5905 135.6307 171.0593 182.1816 196.3037 202.1100 251.0710 313.3621 333.4906 354.7067 403.5449 423.2423 445.9865 474.0303 485.8410 500.1941 529.9505 542.7653 578.0081 609.7435 636.3753 678.8792 685.6757 723.8678 767.6780 794.1717 814.1404 825.0475 858.3003 869.6584 874.1902 918.9858 948.9992 989.4187 1007.2921 1024.7549 1046.8377 1059.7281 1087.3643 1103.9001 1117.9203 1146.3158 1160.2651 1218.5699 1231.8957 1248.5825 1260.4881 1275.2326 1298.4764 1306.2808 1319.6774 1331.5123 1337.1502 1355.3471 1358.1317 1362.1045 1415.3452 1418.4545 1452.5514 1457.4185 1463.2367 1469.6020 1474.4784 1485.9937 1576.1802 1596.6354 1632.7082 1661.5532 2920.7721 2960.6899 2968.6508 2971.3217 2980.6828 2990.2461 3031.7638 3035.4371 3036.9206 3045.4038 3051.5201 3174.1893 3547.1849 3556.7370 3574.7221 3700.3208
redmass: 4.4156 4.0338 3.5014 2.7960 3.8365 3.4323 1.9588 2.1989 3.3196 2.7399 2.3393 2.7964 2.3857 2.2101 1.3529 3.0561 2.1185 1.2186 4.6915 1.2130 4.8863 5.0400 3.5350 3.6759 5.5780 4.5547 3.6748 1.5347 3.3454 1.8755 1.9206 2.1558 2.8434 2.5785 1.4093 3.3651 2.0048 2.8174 3.2667 1.6578 1.6875 1.7670 1.9081 1.0658 2.1948 1.7675 2.2316 1.7449 1.4661 1.2800 1.3817 1.6075 1.6188 1.3991 1.3167 1.4646 1.4218 1.4520 1.4188 4.5923 2.6305 1.0976 1.1000 1.1502 1.1077 1.4028 1.3205 5.7724 1.4010 3.3974 5.1805 1.0822 1.0680 1.0625 1.0625 1.0630 1.0627 1.0971 1.0973 1.0954 1.1028 1.1032 1.0923 1.0481 1.0741 1.0765 1.1046
irintensity: 4.4709 0.1671 2.1869 15.1029 2.4522 2.7254 32.3896 28.1198 0.2932 0.3143 9.4912 2.2348 1.6184 29.4204 133.2658 14.9383 3.5292 205.2551 4.7628 63.5748 4.7308 0.8363 5.3741 8.5443 18.1507 1.7444 0.9541 2.2486 3.8502 69.4137 4.9099 11.7924 8.8632 7.8052 14.1872 2.9390 10.0601 3.0693 16.2032 8.6253 1.3876 0.7395 15.7358 1.0590 7.5043 4.7966 86.2175 10.0830 13.4152 7.0082 16.3188 24.0349 92.0873 7.3107 0.0553 0.3288 9.0930 3.2678 8.5636 55.8902 231.4746 8.2989 8.9697 5.6833 28.8135 12.0612 41.9086 422.0066 29.3567 697.7520 629.7407 49.7947 22.7870 40.9580 35.2647 22.1775 42.0104 83.9975 15.9004 51.7114 10.0678 109.5096 7.7387 61.5219 26.6447 39.4554 38.3334
temp: 298.150 k
press: 1.00000 atm
elementType: 8 7 7 7 7 6 6 6 6 6 6 6 6 6 6 1 1 1 1 1 1 1 1 1 1 1 1 1 1 1 1
symmnumber: 1
zpe: 682336.8 jmol-1
zpe.correction: 0.259888 hartree
zpe.thermalcorrener: 0.274434 hartree
zpe.thermalcorrenthalpy: 0.275379 hartree
zpe.thermalcorrgfe: 0.217346 hartree
zpe.sumelectzpe: -683.761806 hartree
zpe.sumelectthermal: -683.747260 hartree
zpe.sumelectthermalent: -683.746315 hartree
zpe.sumelectthermalfe: -683.804348 hartree
dipole: 9.2480 6.8815 -1.4313
dipole: 11.6160
quadrupole: -114.3684 -83.3327 -91.9113
quadrupole: -24.9830 1.7842 2.0293
quadrupole: -17.8310 13.2048 4.6262 -24.9830 1.7842 2.0293
hfenergy: -684.021694 hartree
pointgroup: C01 [X(C10H16N4O1)]
dipole: -3.6837984 -2.5472791 -0.9091606 debye
polarizability: 180.9756593|8.3463574|146.3707462|13.6949666|8.8015039|95.4630691 unknown
InChI: InChI=1S/C10H16N4O/c11-10-13-8(6-9(15)14-10)12-7-4-2-1-3-5-7/h6-7,12-13H,1-5,11H2
charge 0 multiplicity 1
31 atoms
O  3.674705 2.068144 0.683614
N  -0.741527 0.518133 -0.630262
N  1.115871 -0.951138 -0.368697
N  3.317126 -0.225098 0.302286
N  2.902557 -2.48741 -0.152408
C  -1.754845 -0.55153 -0.758891
C  -2.111503 -1.21519 0.606232
C  -3.026544 0.036802 -1.424442
C  -2.875121 -0.246627 1.539477
C  -3.802848 0.99736 -0.488752
C  -4.145468 0.31318 0.85603
C  0.593622 0.352062 -0.283032
C  1.443987 1.379425 0.096854
C  2.472172 -1.171164 -0.052818
C  2.865768 1.141463 0.373314
H  -1.359946 -1.332847 -1.446591
H  -1.191797 -1.575248 1.106182
H  -2.741883 -2.105228 0.400704
H  -3.690055 -0.807891 -1.693644
H  -2.748224 0.543575 -2.368207
H  -2.206628 0.590235 1.825639
H  -3.143494 -0.769152 2.476973
H  -4.725812 1.334096 -0.997254
H  -3.21165 1.916389 -0.290709
H  -4.856683 -0.51806 0.6688
H  -4.657661 1.027546 1.527982
H  -1.078254 1.480242 -0.616972
H  0.54707 -1.699134 -0.764768
H  1.072482 2.403169 0.188573
H  2.269763 -3.280046 -0.221273
H  3.884122 -2.646758 0.062558
