program: Gaussian 09
title: 000242653
version: EM64L-G09RevD.01
frameworkgroup: C1[X(C7H8N4O2)]
method: RPBEPBE
basis: SDD
operation: Freq
keyword: #pfreq=noraman
keyword: PBEPBE/SDD
title: #p freq=noraman PBEPBE/SDD
converged: YES YES NO NO
title: Mulliken charges:
elementType: O O N N N N C C C C C C C H H H H H H H H
charge: -0.428606 -0.193870 -0.170233 -0.362404 -0.021878 -0.000236 0.323939 -0.397891 -0.104280 -0.264601 -0.298933 0.037681 -0.234058 0.260186 0.208925 0.288924 0.238097 0.200020 0.315952 0.240424 0.362843
chargesum: 0.00000
title: Mulliken charges with hydrogens summed into heavy atoms:
elementType: O O N N N N C C C C C C C
charge: -0.065763 -0.193870 -0.170233 -0.046452 -0.021878 -0.000236 0.323939 0.071220 -0.104280 0.024324 0.139184 0.037681 0.006366
polarizability: 1.43238260e+02 4.41483185e+00 1.16455434e+02 -1.45424336e+01 -1.84718795e+00 6.02613624e+01
1716.lowfreq: -13.7849 -9.5125 0.0007 0.0008 0.0011 1.2477 33.8794 52.2481 95.4316
frequency: 33.6779 52.1526 95.4196 120.0724 173.0457 217.6130 263.7640 319.0623 333.7925 367.1707 451.0337 476.5340 482.4588 508.1370 530.5943 582.6701 639.1408 658.9949 670.6949 683.7343 764.6228 790.0298 843.2757 861.4377 886.4965 916.1707 934.3290 1004.1509 1018.8056 1036.3108 1084.3950 1135.7495 1183.5303 1190.2410 1255.3147 1301.7878 1324.3769 1332.7042 1340.1294 1345.9264 1360.7510 1375.4577 1415.8436 1456.2348 1461.0166 1510.3056 1535.3018 1597.0327 1639.0280 2965.0168 3000.7509 3079.2090 3086.4512 3121.3606 3235.1044 3535.4959 3554.7465
redmass: 5.3999 7.5716 5.3898 3.5191 4.7385 4.6142 3.9350 5.2523 1.1917 2.8918 4.2737 3.9018 3.8813 2.7417 1.4809 6.4398 3.6993 12.1456 6.6550 4.7054 2.3351 2.5828 3.0917 6.0642 1.4618 2.6512 3.4761 3.8764 2.6206 3.0699 2.9090 2.0406 1.5758 1.6187 2.1345 1.8783 2.5736 1.4351 1.9798 1.5913 1.4987 1.2473 3.0343 1.1700 1.0952 4.0820 7.3428 6.4566 12.3712 1.0683 1.0648 1.0971 1.0987 1.0926 1.0988 1.0793 1.0665
irintensity: 3.0532 5.4874 3.7756 2.5166 1.0231 3.9591 1.9813 13.1553 178.9381 8.2616 11.1292 18.9840 24.5604 22.0956 61.7903 1.3414 4.5572 5.5004 5.2394 16.3788 16.2887 1.4291 7.4532 7.1620 12.2303 56.1160 13.8889 63.5322 51.4981 3.2954 45.4022 9.9322 23.7302 26.0960 3.2970 9.0336 27.9682 17.2207 24.9468 9.9045 18.1333 11.2619 8.6445 17.3657 7.0645 14.0763 301.2952 75.0612 362.3301 41.9342 34.5164 12.6662 27.2962 20.5763 1.0946 26.5447 7.5560
temp: 298.150 k
press: 1.00000 atm
elementType: 8 8 7 7 7 7 6 6 6 6 6 6 6 1 1 1 1 1 1 1 1
symmnumber: 1
zpe: 407559.7 jmol-1
zpe.correction: 0.155231 hartree
zpe.thermalcorrener: 0.166530 hartree
zpe.thermalcorrenthalpy: 0.167474 hartree
zpe.thermalcorrgfe: 0.116871 hartree
zpe.sumelectzpe: -640.017224 hartree
zpe.sumelectthermal: -640.005926 hartree
zpe.sumelectthermalent: -640.004981 hartree
zpe.sumelectthermalfe: -640.055584 hartree
dipole: 8.2370 7.0562 -2.3699
dipole: 11.1021
quadrupole: -103.3710 -70.8666 -74.5420
quadrupole: -5.1434 -1.9734 -0.7993
quadrupole: -20.4445 12.0600 8.3845 -5.1434 -1.9734 -0.7993
hfenergy: -640.1724557 hartree
pointgroup: C01 [X(C7H8N4O2)]
dipole: 3.1651531 -2.8074869 1.0854699 debye
dipolederiv: -0.2797375 -0.058102 0.1662085 -0.1242828 -0.5705065 0.0810501 0.2915146 0.0367919 -0.6964388 -0.9163847 0.3314813 -0.1450322 0.4820484 -0.721498 0.1332509 -0.1747562 0.1059301 -0.3844593 -0.693908 0.1245264 -0.0656995 0.2566641 -0.3616436 0.0192653 -0.1125275 0.0326653 -0.204642 -0.9363595 -0.0968216 -0.1490563 -0.1139262 -0.6466815 0.0145302 -0.1485232 0.0001774 -0.2312571 -0.431676 0.0515786 -0.0118343 0.1018666 -0.3097922 0.0196388 -0.0674489 0.0010134 -0.2262279 -0.595639 0.0797341 -0.0743044 0.4844913 -0.8586932 0.1528985 -0.1148988 0.0554285 -0.2976027 0.6343731 0.0290466 0.0810379 0.0873954 0.5120142 -0.0345775 0.1088568 -0.0484678 0.1093777 0.52851 -0.1639722 0.0565544 -0.197946 0.1990211 -0.0669535 0.1579453 -0.0473277 0.1489395 -0.5150194 0.2990361 -0.1105166 0.1524496 -0.0508322 0.0122052 -0.1282524 0.0872652 -0.0609376 0.1053696 -0.20906 0.053181 -0.4393373 0.432383 -0.0615476 0.117829 -0.0285241 -0.0825718 0.2584667 0.0658263 -0.079057 0.1502437 0.4427064 -0.0888068 -0.1971707 -0.1098111 0.4511828 1.3137416 -0.3935622 0.2583704 -0.5604738 1.2271778 -0.1957811 0.3009613 -0.1546226 0.3295046 1.270305 -0.0731878 0.2956575 -0.2559147 0.4383095 -0.0901806 0.3339331 -0.044645 0.0677215 -0.0091982 0.0029728 -0.0449439 -0.0559578 0.0242662 -0.1098973 -0.0372865 -0.0426046 0.044992 0.0037709 -0.0510367 0.0849194 0.0472968 -0.0864951 0.1241377 0.0315939 0.0879552 0.0164124 0.0272238 -0.0372816 -0.0395561 -0.0170563 0.111912 0.0034465 -0.050938 -0.0092739 0.1665919 -0.0872919 0.1130572 -0.0345755 0.0765955 0.0108534 0.0448806 0.0076584 0.0448207 0.065467 -0.0185003 -0.1534471 -0.0646123 -0.1044879 -0.0684087 -0.038393 -0.0435841 -0.0425945 -0.048006 0.1399435 0.0380796 -0.0596829 0.0064563 0.1658834 0.0042112 -0.0621567 0.0207741 0.3151194 0.0902445 0.0246085 -0.0121025 -0.0177049 -0.1287232 0.0146134 -0.0103539 0.0222326 0.1314196 0.1117656 0.0765236 -0.1049555 0.0415798 0.2387474 0.0620091 -0.2023954 0.0328171 0.3854148 unknown
polarizability: 142.8524685|-4.3437266|116.3458166|15.1320624|-4.950391|60.7567704 unknown
InChI: InChI=1S/C7H8N4O2/c12-2-1-11-4-10-5-6(11)8-3-9-7(5)13/h3-4,8,12H,1-2H2
charge 0 multiplicity 1
21 atoms
O  3.730985 0.279764 -1.191458
O  -3.129587 1.30782 -0.604086
N  1.265868 0.15466 0.574872
N  -0.390393 -1.709607 0.262414
N  -0.15074 1.90119 0.113256
N  -2.620347 -0.983058 -0.333106
C  0.019361 -0.385954 0.283565
C  2.530064 -0.559351 0.822085
C  -0.854511 0.686049 0.003336
C  1.098999 1.558531 0.44781
C  3.268707 -0.914508 -0.489577
C  -2.266781 0.437997 -0.333429
C  -1.74791 -1.921278 -0.057818
H  3.176374 0.099235 1.427269
H  2.332457 -1.471313 1.418881
H  1.920929 2.244899 0.639772
H  4.185667 -1.475755 -0.244474
H  2.627213 -1.548728 -1.137857
H  0.225941 -2.495287 0.478234
H  -2.053951 -2.975191 -0.066006
H  2.960855 0.762083 -1.587884
