program: Gaussian 09
title: 000242651
version: EM64L-G09RevD.01
frameworkgroup: C1[X(C16H15FN4OS)]
method: RPBEPBE
basis: SDD
operation: Freq
keyword: #p
keyword: freq=noraman
keyword: PBEPBE/SDD
title: #p freq=noraman PBEPBE/SDD
converged: YES YES NO NO
title: Mulliken charges:
elementType: S F O N N N N C C C C C C C C C C C C C C C C H H H H H H H H H H H H H H H
charge: 0.278184 -0.200235 -0.267844 -0.203886 -0.048500 -0.032998 -0.005800 -0.039416 -0.467801 -0.466375 -0.301730 0.131209 -0.204086 0.107750 -0.348087 -0.386478 -0.779887 0.315197 0.172949 -0.318210 -0.359353 -0.235784 -0.198396 0.277764 0.230759 0.292950 0.240749 0.245019 0.227917 0.224433 0.294168 0.247780 0.308418 0.297767 0.247625 0.256258 0.232215 0.235755
chargesum: 0.00000
title: Mulliken charges with hydrogens summed into heavy atoms:
elementType: S F O N N N N C C C C C C C C C C C C C C C C
charge: 0.278184 -0.200235 -0.267844 -0.203886 -0.048500 -0.032998 -0.005800 0.238348 0.055908 0.019393 0.150620 0.131209 0.090082 0.107750 -0.348087 -0.138698 -0.173702 0.315197 0.172949 -0.070585 -0.103094 -0.003569 0.037359
polarizability: 3.61114196e+02 -1.16611560e+01 1.79722163e+02 2.56493265e+00 -2.72878157e+00 1.53412462e+02
1716.lowfreq: -22.0869 -0.0014 -0.0007 -0.0003 0.6847 3.7481 6.9926 14.7910 24.1877
frequency: -13.0234 9.1257 23.7385 36.7160 39.5421 65.6394 89.7408 105.8658 134.7389 141.5269 170.6406 190.7396 216.0840 249.2942 271.6989 285.0343 291.4416 301.9604 379.1858 403.8371 421.3564 458.9769 507.4700 527.3749 537.0784 548.9115 572.5499 578.8794 606.3959 624.1691 637.6348 650.2011 662.0433 679.7457 733.7458 754.8381 761.8336 767.6446 791.6950 811.3335 828.1487 831.4264 861.7063 861.9049 869.1089 886.3695 890.0151 907.4984 916.6889 919.1037 938.8197 945.2575 982.6843 1028.0955 1029.7171 1043.1883 1068.6017 1074.8243 1105.8640 1120.4823 1135.6863 1154.4907 1160.2520 1170.2121 1172.0598 1181.9159 1183.5596 1218.3784 1226.1924 1250.8894 1257.1871 1280.2475 1281.8944 1287.1582 1301.9186 1307.2666 1318.8528 1332.0583 1343.8979 1363.2569 1386.1037 1391.4456 1432.2607 1437.1529 1443.0287 1471.0447 1477.1043 1480.0068 1493.3630 1507.7271 1538.3523 1588.5338 1621.5874 3013.1154 3026.0009 3027.8808 3059.6125 3063.7833 3076.1295 3098.8063 3113.0585 3135.1789 3142.7161 3147.1124 3165.0455 3169.0224 3180.2415 3260.2771
redmass: 3.9164 6.5058 6.3860 5.7478 5.1576 5.8161 4.0255 6.7373 3.7201 6.9722 6.4050 3.7334 5.1111 4.8331 3.0986 4.9365 5.9166 8.2646 3.3645 6.6452 5.2901 3.9330 5.7827 5.0026 4.6233 6.3301 3.9043 5.5551 3.2454 7.6787 5.5334 5.3141 5.9428 6.0328 4.6589 2.9606 4.5489 1.4809 8.2302 9.9258 2.9058 4.3241 1.4500 1.4046 2.4754 1.9018 1.6980 3.4317 2.8112 1.4331 2.5730 1.3814 1.3216 3.7927 2.0691 2.1791 2.6552 1.9653 3.3554 2.3032 1.1556 1.4833 1.5747 1.0774 2.2244 2.4333 2.4585 1.3458 2.2588 1.4343 1.5978 2.3685 1.4622 8.3871 3.9558 1.4239 1.2610 1.5000 1.5099 3.9398 8.2091 1.5822 3.8455 1.6440 1.4130 1.0913 1.0938 2.7662 1.0999 8.5486 10.5777 6.5687 7.5441 1.0578 1.0664 1.0623 1.0884 1.0584 1.1066 1.1042 1.1035 1.0869 1.1076 1.0906 1.0957 1.0921 1.0991 1.0983
irintensity: 1.9620 0.9832 0.2136 1.5856 1.1871 2.2425 0.5119 0.1827 0.9417 3.5191 7.1415 0.5150 2.7855 1.4203 4.2849 0.1043 2.7932 2.0621 7.0139 1.4409 13.2958 5.4824 1.6214 8.2896 2.1390 12.1139 1.6996 22.8775 11.4334 0.5300 19.8367 11.5318 1.0669 15.3569 9.7569 26.9257 42.9671 68.9407 4.8556 46.8534 18.0511 4.8852 1.4475 16.1677 5.7000 28.9527 5.2647 52.6156 28.0788 10.5233 13.7895 2.2088 0.0237 154.6388 5.5600 28.6598 11.0603 20.4821 5.6924 16.6069 11.3730 72.6097 16.4393 1.0200 18.5484 0.9570 188.9485 84.8403 9.5697 9.5542 0.4607 16.6540 3.1307 42.1872 85.5026 12.7712 2.6662 99.8301 30.5810 18.3620 0.7619 64.1686 73.8565 19.3635 12.0925 21.9345 16.8959 45.4532 9.6713 211.8902 126.4128 13.2506 4.2812 69.6929 20.8552 21.6126 23.6104 3.7212 11.6775 42.2498 17.1188 2.9520 2.1648 11.0184 17.3421 16.3565 10.1816 3.7274
temp: 298.150 k
press: 1.00000 atm
elementType: 16 9 8 7 7 7 7 6 6 6 6 6 6 6 6 6 6 6 6 6 6 6 6 1 1 1 1 1 1 1 1 1 1 1 1 1 1 1
symmnumber: 1
zpe: 753784.9 jmol-1
zpe.correction: 0.287102 hartree
zpe.thermalcorrener: 0.306009 hartree
zpe.thermalcorrenthalpy: 0.306953 hartree
zpe.thermalcorrgfe: 0.236135 hartree
zpe.sumelectzpe: -1409.180683 hartree
zpe.sumelectthermal: -1409.161776 hartree
zpe.sumelectthermalent: -1409.160832 hartree
zpe.sumelectthermalfe: -1409.231650 hartree
dipole: -2.4740 1.1102 -0.3922
dipole: 2.7399
quadrupole: -94.3767 -146.8005 -137.4370
quadrupole: -8.2359 -14.9906 -0.7851
quadrupole: 31.8280 -20.5958 -11.2322 -8.2359 -14.9906 -0.7851
hfenergy: -1409.4677843 hartree
pointgroup: C01 [X(C16H15F1N4O1S1)]
dipole: -0.9716498 0.4654441 0.0354193 debye
polarizability: 361.0315346|-12.6327392|177.1103903|0.0166763|8.3223305|156.1068959 unknown
InChI: InChI=1S/C16H15FN4OS/c17-12-5-2-1-4-11(12)8-23-16-14-15(18-9-19-16)21(10-20-14)13-6-3-7-22-13/h1-2,4-5,9-10,13H,3,6-8H2
charge 0 multiplicity 1
38 atoms
S  1.567735 -0.704679 -0.180243
F  4.504614 -0.394256 2.393161
O  -5.698091 -1.065165 -0.893278
N  -3.449617 -0.291891 -0.596879
N  -1.585895 -1.633183 -0.766774
N  -2.344265 1.838944 0.063578
N  0.08869 1.589708 0.243386
C  -4.88372 0.127562 -0.72625
C  -5.395757 0.822004 0.550505
C  -5.778224 -0.384053 1.4467
C  -6.325303 -1.410842 0.429956
C  -2.355788 0.518188 -0.277774
C  -2.924823 -1.562001 -0.892241
C  -1.207782 -0.335486 -0.383253
C  0.044761 0.268092 -0.095107
C  -1.083377 2.299143 0.303643
C  2.83775 0.653546 0.302326
C  4.227083 0.136585 0.041694
C  5.034124 -0.373531 1.083154
C  4.798958 0.142073 -1.258155
C  6.339784 -0.855171 0.895512
C  6.106949 -0.336408 -1.486993
C  6.878463 -0.835719 -0.410261
H  -4.982587 0.735525 -1.640942
H  -6.290704 1.413777 0.286841
H  -4.643824 1.494188 0.990286
H  -4.885624 -0.777377 1.963543
H  -6.528346 -0.115967 2.208341
H  -6.057853 -2.45476 0.666504
H  -7.418491 -1.331446 0.292714
H  -3.574486 -2.378933 -1.192907
H  -0.991678 3.353712 0.578224
H  2.661697 0.889257 1.360624
H  2.585303 1.532082 -0.309312
H  4.198685 0.523264 -2.092039
H  6.90758 -1.232644 1.750744
H  6.524133 -0.321374 -2.499035
H  7.893624 -1.207864 -0.58289
