program: Gaussian 09
title: 000242647
version: EM64L-G09RevD.01
frameworkgroup: C1[X(C9H9NO4S)]
method: RPBEPBE
basis: SDD
operation: Freq
keyword: #p
keyword: freq=noraman
keyword: PBEPBE/SDD
title: #p freq=noraman PBEPBE/SDD
converged: YES YES NO NO
title: Mulliken charges:
elementType: S O O O O N C C C C C C C C C H H H H H H H H H
charge: 0.197972 -0.426082 -0.206927 -0.207164 -0.216101 0.027224 0.500563 -0.832759 -0.330918 -0.351785 0.372696 -0.346770 -0.345780 -0.733676 0.279466 0.269816 0.312865 0.251855 0.248299 0.287384 0.287644 0.279345 0.296260 0.386575
chargesum: 0.00000
title: Mulliken charges with hydrogens summed into heavy atoms:
elementType: S O O O O N C C C C C C C C C
charge: 0.197972 -0.039507 -0.206927 -0.207164 -0.216101 0.027224 0.500563 -0.250078 -0.079063 -0.103486 0.372696 -0.059386 -0.058136 -0.158072 0.279466
polarizability: 2.28880128e+02 -7.12214367e-02 1.28703130e+02 -5.42806719e-01 -4.38039987e+00 8.22997489e+01
1716.lowfreq: -14.5737 -6.5425 -0.0021 -0.0018 0.0010 3.0194 11.4436 19.5946 43.3397
frequency: 9.5476 19.4844 43.3276 59.1672 65.6521 92.1281 140.7983 147.4360 210.3778 212.4567 293.2449 341.3837 372.4835 398.4388 406.9242 481.7402 505.6542 506.0241 579.6552 617.3804 626.9961 637.4845 645.6789 673.6825 729.8434 748.1400 763.3410 819.1165 829.2966 849.5505 866.0476 890.9057 908.3264 986.5408 993.6639 1005.7155 1058.0223 1092.1223 1093.0511 1133.8654 1171.2766 1180.2456 1219.7414 1222.2800 1236.8416 1247.3085 1299.7268 1302.7232 1366.7843 1403.7271 1418.7713 1419.3390 1471.6912 1480.9260 1596.8345 1608.3412 1671.3092 3028.6026 3053.8188 3108.0830 3144.1132 3144.6826 3147.7392 3183.2346 3185.6614 3515.2924
redmass: 6.3645 7.2328 9.1826 8.8067 7.2804 6.7243 6.0229 7.2454 5.9828 6.3742 6.7644 2.7908 5.9884 2.6255 2.8690 4.0061 5.1245 5.5468 2.5311 5.6244 6.7283 5.6975 1.7760 3.9471 5.7615 4.8861 6.2471 5.4267 5.3023 1.2456 1.6923 2.0516 1.4849 1.3433 1.3761 3.0491 1.8155 2.3776 1.4776 1.0892 1.2143 1.3120 3.0972 3.5395 1.2283 1.3490 1.3221 2.0988 7.8389 8.4178 1.2061 2.7958 1.1163 2.4936 7.7195 6.3541 8.6629 1.0574 1.0594 1.1087 1.0910 1.1058 1.0909 1.0945 1.0957 1.0641
irintensity: 1.2490 0.1887 1.5606 0.4063 0.0196 1.8537 2.5735 0.7453 0.5390 2.5470 0.9592 0.5128 7.0605 1.2647 0.0318 13.0658 15.0152 15.3367 37.8617 9.0883 1.2109 9.3038 123.2764 40.2827 11.3343 9.1050 24.4485 5.2036 30.7856 0.0707 40.3849 3.6493 0.4840 4.3295 0.0811 5.1137 176.6587 13.2100 19.5031 5.6327 35.8416 57.1586 157.3637 163.2935 1.6134 1.1989 2.3695 29.0713 93.5746 0.4677 12.1934 65.5578 5.4545 5.4902 1.1643 49.6339 315.0553 15.3251 8.6737 6.3618 8.9784 0.3714 5.3260 0.0756 4.2587 27.7099
temp: 298.150 k
press: 1.00000 atm
elementType: 16 8 8 8 8 7 6 6 6 6 6 6 6 6 6 1 1 1 1 1 1 1 1 1
symmnumber: 1
zpe: 446708.3 jmol-1
zpe.correction: 0.170142 hartree
zpe.thermalcorrener: 0.184751 hartree
zpe.thermalcorrenthalpy: 0.185695 hartree
zpe.thermalcorrgfe: 0.123998 hartree
zpe.sumelectzpe: -1100.886037 hartree
zpe.sumelectthermal: -1100.871428 hartree
zpe.sumelectthermalent: -1100.870484 hartree
zpe.sumelectthermalfe: -1100.932181 hartree
dipole: -4.6137 -1.3083 3.3691
dipole: 5.8607
quadrupole: -129.8865 -86.1172 -96.4136
quadrupole: -0.5844 -6.9279 2.3289
quadrupole: -25.7474 18.0219 7.7255 -0.5844 -6.9279 2.3289
hfenergy: -1101.056179 hartree
pointgroup: C01 [X(C9H9N1O4S1)]
dipole: -1.8337925 0.3396771 1.3559045 debye
dipolederiv: -0.1790982 -0.016123 -0.0758008 0.0104542 -0.1274445 0.1132942 -0.0594065 0.116241 -0.0756787 -0.5212036 -0.1718214 -0.0838859 -0.0873388 -0.9064372 -0.3982418 -0.0217797 -0.320854 -0.4858253 -0.6937478 -0.1110454 0.1631198 -0.1385094 -0.4835887 0.2511552 0.2204209 0.2622174 -0.4961423 -0.8669575 0.167869 -0.0774233 0.2088346 -0.443239 0.1775722 -0.0774336 0.1724222 -0.3824911 -0.7083103 -0.0690469 -0.3145859 0.2243774 -0.5317047 0.080067 -0.5945779 -0.0615486 -0.6803634 1.9346761 -0.0190056 -0.206296 -0.0412475 0.6768313 -0.4461005 -0.2977908 -0.4566187 0.6530399 0.5157269 0.051813 -0.0013857 -0.0304336 0.0226184 -0.0708031 -0.1423724 -0.0896316 -0.0175676 0.0854555 0.0877852 0.1005918 0.1612736 0.1248655 0.0294185 0.0647835 0.007084 0.2027931 -0.2009253 -0.1559043 0.12602 -0.163296 -0.0606226 -0.041369 0.2260795 -0.0285273 -0.1094341 -0.364897 0.0767694 -0.0798141 0.1233094 -0.0146918 -0.1276016 -0.0701251 -0.1137735 -0.0024232 -0.7622497 -0.0615495 0.1313743 -0.0417553 0.0452262 0.0089422 0.1979086 0.0154206 0.0146821 0.1844371 0.0989517 -0.1297289 -0.1283287 -0.0673896 -0.0015876 0.0645428 -0.0516425 -0.0556296 0.1631878 -0.0841288 0.0417872 0.1374203 -0.0598344 -0.0494765 -0.173001 -0.0095668 -0.0513768 -0.0321293 0.0801515 -0.1147668 0.0460382 -0.1375427 0.0057629 -0.1185655 0.0144106 0.0370868 0.8174975 0.0923344 0.6162809 -0.3574343 1.2555506 0.1759503 0.9072437 0.1990091 0.8469318 -0.0201666 -0.0282695 -0.018847 -0.0677268 0.0378926 0.0384455 -0.0070608 0.005424 -0.1148861 0.0606954 -0.0185472 0.0054952 -0.0371103 -0.0413651 -0.0334843 -0.0124135 -0.0009459 0.0568121 0.0080232 0.0793726 -0.0366869 0.0813457 0.0648099 0.0594839 -0.0501296 0.0545507 0.084968 0.0661819 -0.0396734 0.0664019 -0.0443476 0.0490826 0.0905241 0.0615677 0.0926338 0.0415483 0.1109004 -0.0309378 0.0375101 -0.0051475 0.1088467 0.0582903 0.0162788 0.0642975 0.1055072 0.0797671 0.053132 -0.0371197 0.032202 0.1153976 0.0459604 -0.0090397 0.0419958 0.1333625 0.0599689 0.01885 0.0042007 0.0693241 0.0872993 -0.0339703 0.0521847 0.0140317 -0.0654769 -0.0467113 -0.0534288 -0.0211745 0.0265142 0.0356422 -0.0048714 -0.0264605 -0.0400198 0.1087333 0.3098787 0.052453 -0.0952667 0.0215822 0.2497973 0.0726393 -0.1508539 0.1133904 0.2518302 unknown
polarizability: 228.8680438|0.6152851|108.92444|1.2777666|-23.358297|102.0905232 unknown
InChI: InChI=1S/C9H9NO4S/c11-9(12)6-15-5-7-1-3-8(4-2-7)10(13)14/h1-4,11H,5-6H2
charge 0 multiplicity 1
24 atoms
S  -2.327604 -1.194715 -0.206696
O  -4.171334 1.539628 0.295567
O  4.562883 1.09231 -1.197277
O  5.00353 -0.574018 0.296968
O  -5.444249 0.452511 -1.32104
N  4.194571 0.229132 -0.310051
C  0.021895 0.029342 0.696119
C  -1.442639 -0.039275 1.047709
C  0.484761 0.951238 -0.281623
C  0.957808 -0.833121 1.326749
C  2.752682 0.156447 0.033907
C  1.84894 1.024536 -0.618064
C  2.327237 -0.776623 1.003806
C  -4.130113 -0.867741 0.301834
C  -4.670344 0.386613 -0.344626
H  -1.604633 -0.46406 2.051853
H  -1.941646 0.939086 0.967644
H  -0.233447 1.610514 -0.780829
H  0.608256 -1.552589 2.07535
H  2.224765 1.72937 -1.364137
H  3.062099 -1.430011 1.480996
H  -4.173552 -0.801929 1.400339
H  -4.70238 -1.736914 -0.052005
H  -4.526184 2.347066 -0.166693
