program: Gaussian 09
title: 000242646
version: EM64L-G09RevD.01
frameworkgroup: C1[X(C12H13NO4)]
method: RPBEPBE
basis: SDD
operation: Freq
keyword: #p
keyword: freq=noraman
keyword: PBEPBE/SDD
title: #p freq=noraman PBEPBE/SDD
converged: NO YES NO NO
title: Mulliken charges:
elementType: O O O O N C C C C C C C C C C C C H H H H H H H H H H H H H
charge: -0.316914 -0.224288 -0.194773 -0.180387 -0.443327 0.516217 0.317657 -0.466157 -0.343699 -0.320627 -0.357060 0.119229 0.085796 -0.790756 -0.253705 0.170679 -0.655641 0.227665 0.309299 0.244097 0.281222 0.360756 0.227343 0.244028 0.236380 0.236649 0.262954 0.226532 0.253935 0.226896
chargesum: 0.00000
title: Mulliken charges with hydrogens summed into heavy atoms:
elementType: O O O O N C C C C C C C C C C C C
charge: -0.316914 -0.224288 -0.194773 -0.180387 -0.082572 0.516217 0.317657 -0.238492 -0.034399 -0.076530 -0.075837 0.119229 0.085796 -0.054773 0.217666 0.170679 0.051722
polarizability: 2.74302133e+02 9.01480226e+00 1.55027778e+02 -3.39516985e+00 6.09486602e+00 7.65834777e+01
1716.lowfreq: -8.7228 -4.7228 -2.7253 -0.0005 -0.0003 0.0003 28.6464 30.2043 50.3627
frequency: 28.5906 30.1880 50.3388 63.6578 79.3648 85.2200 92.1451 138.3271 143.8143 153.4839 208.1415 209.5360 283.0627 294.8597 316.5516 351.0902 369.3574 395.5846 410.3083 461.9843 474.2949 490.0093 532.1593 568.2115 593.6491 628.4847 685.4726 729.1738 744.7997 754.5852 770.8013 803.2069 821.7256 836.2015 837.6162 878.6561 886.4544 945.4791 957.9827 1003.6590 1005.9573 1013.7289 1029.0385 1069.4636 1077.4010 1096.6711 1128.6356 1150.6581 1177.9247 1191.5660 1265.5999 1276.2320 1280.4393 1308.1693 1352.0027 1364.5221 1374.7790 1394.4775 1423.3973 1447.0207 1458.8396 1462.9001 1464.1308 1483.6600 1496.8368 1510.2196 1569.3473 1598.7615 1621.0281 1631.8353 1665.2047 2983.9883 2996.2911 3034.8401 3068.3106 3091.6908 3097.7935 3119.5736 3123.8126 3125.3895 3155.0945 3157.8874 3196.1238 3474.0594
redmass: 4.1118 4.0428 4.3042 6.2118 4.7255 4.8644 4.4185 1.1428 4.0146 4.3108 3.8201 1.4330 2.6927 5.2374 4.6796 8.8230 5.3278 4.1902 2.9555 5.3805 4.8634 3.8083 5.0141 4.8510 2.2859 7.0941 4.8177 3.9850 3.3503 2.1602 2.0475 1.7170 2.4954 1.4173 5.2543 5.4516 1.3867 2.1903 1.3790 3.0689 2.6960 1.4412 1.6640 3.5366 3.6724 2.2209 1.3329 1.7988 3.6000 1.1435 1.9558 1.2503 3.1409 1.3511 1.2624 1.5765 2.7923 1.2270 4.3100 1.0978 1.0883 1.0503 1.0450 1.0516 1.9804 2.8696 5.2859 5.9171 6.5659 8.2108 9.7906 1.0375 1.0362 1.0596 1.0970 1.0975 1.1033 1.0893 1.1067 1.0989 1.0912 1.0942 1.0951 1.0766
irintensity: 0.6655 0.0624 0.4032 1.2326 2.9729 1.4434 0.7112 0.1804 1.4529 1.3100 6.8287 4.6378 8.7001 1.1081 3.6822 3.2259 1.3656 3.6661 0.1607 4.7816 4.6848 23.1539 1.6662 11.2177 17.4502 0.2429 30.8831 9.6484 1.3313 22.6746 17.0980 2.4364 4.7496 74.4479 2.6326 61.2794 56.1557 38.4951 1.2154 7.3526 68.7441 0.0433 1.6285 135.0058 214.7750 6.8905 7.5931 42.4937 35.7855 50.3248 65.4438 48.9077 200.0154 3.9710 1.2922 14.4346 208.5186 25.5124 53.6946 26.2288 15.0891 21.1541 17.7329 12.0821 112.0458 174.7298 287.4157 80.6986 127.0920 95.7315 221.3639 3.8723 15.3428 27.1988 13.3269 32.7952 1.3209 16.1934 22.6081 15.2061 6.2698 6.3767 2.2634 77.7386
temp: 298.150 k
press: 1.00000 atm
elementType: 8 8 8 8 7 6 6 6 6 6 6 6 6 6 6 6 6 1 1 1 1 1 1 1 1 1 1 1 1 1
symmnumber: 1
zpe: 604853.0 jmol-1
zpe.correction: 0.230376 hartree
zpe.thermalcorrener: 0.247371 hartree
zpe.thermalcorrenthalpy: 0.248316 hartree
zpe.thermalcorrgfe: 0.183424 hartree
zpe.sumelectzpe: -819.494473 hartree
zpe.sumelectthermal: -819.477477 hartree
zpe.sumelectthermalent: -819.476533 hartree
zpe.sumelectthermalfe: -819.541425 hartree
dipole: 3.0751 -8.0826 -0.6881
dipole: 8.6752
quadrupole: -103.2600 -101.7215 -99.5008
quadrupole: -4.4842 0.9383 0.4004
quadrupole: -1.7659 -0.2274 1.9933 -4.4842 0.9383 0.4004
hfenergy: -819.7248489 hartree
pointgroup: C01 [X(C12H13N1O4)]
dipole: 1.1174485 3.079383 0.9580377 debye
polarizability: 274.3455928|-7.7433129|148.9118229|7.4739241|21.1695705|82.6559724 unknown
InChI: InChI=1S/C12H13NO4/c1-3-17-12(16)11(15)13-10-6-4-9(5-7-10)8(2)14/h4-7,13H,3H2,1-2H3
charge 0 multiplicity 1
30 atoms
O  3.490582 0.756601 0.57856
O  -5.332333 -0.927142 -0.626076
O  1.663209 -2.147785 -0.519207
O  4.393389 -1.306672 -0.065257
N  1.035372 0.033207 0.150062
C  -0.376214 0.007541 0.039798
C  -3.215543 0.110184 -0.135854
C  -1.076432 1.200178 0.375554
C  -1.102604 -1.141249 -0.3860
C  -2.477062 1.248613 0.287962
C  -2.50292 -1.074661 -0.467606
C  -4.712366 0.110722 -0.246713
C  1.940274 -0.986541 -0.119421
C  -5.477415 1.382298 0.111388
C  4.86776 1.303673 0.827281
C  3.412419 -0.567419 0.118446
C  5.457246 1.880807 -0.460864
H  -0.517359 2.085314 0.703973
H  -0.563753 -2.054877 -0.642662
H  -2.993742 2.177224 0.550778
H  -3.082721 -1.945034 -0.792524
H  1.468144 0.90854 0.468037
H  4.703916 2.07292 1.598244
H  5.489501 0.484889 1.229002
H  -5.168928 2.227627 -0.531813
H  -5.291308 1.677167 1.161067
H  -6.554157 1.201536 -0.025315
H  6.436248 2.344887 -0.240436
H  5.616177 1.089194 -1.211814
H  4.79812 2.655661 -0.888394
