program: Gaussian 09
title: 000242645
version: EM64L-G09RevD.01
frameworkgroup: C1[X(C12H13NO4)]
method: RPBEPBE
basis: SDD
operation: Freq
keyword: #p
keyword: freq=noraman
keyword: PBEPBE/SDD
title: #p freq=noraman PBEPBE/SDD
converged: YES YES NO NO
title: Mulliken charges:
elementType: O O O O N C C C C C C C C C C C C H H H H H H H H H H H H H
charge: -0.317396 -0.218324 -0.201081 -0.181489 -0.454631 0.520808 0.364001 -0.581800 -0.348826 -0.381471 -0.210877 0.113111 0.083128 -0.789919 -0.253845 0.167825 -0.655943 0.237365 0.312461 0.281818 0.236956 0.359119 0.265918 0.237662 0.238066 0.226733 0.243656 0.226272 0.254180 0.226524
chargesum: 0.00000
title: Mulliken charges with hydrogens summed into heavy atoms:
elementType: O O O O N C C C C C C C C C C C C
charge: -0.317396 -0.218324 -0.201081 -0.181489 -0.095512 0.520808 0.364001 -0.344435 -0.036365 -0.099652 0.026079 0.113111 0.083128 -0.048274 0.216544 0.167825 0.051032
polarizability: 2.39220490e+02 8.42281583e+00 1.69154577e+02 3.69805123e+00 -5.11842780e+00 7.64343494e+01
1716.lowfreq: -5.7896 -0.0003 0.0007 0.0007 2.9888 7.9440 24.8337 35.9987 51.0488
frequency: 24.7783 35.9458 51.0464 67.2446 75.4095 81.2711 104.1824 156.8354 159.2457 161.9066 206.6547 217.4806 257.2299 288.8014 309.7974 354.6837 364.8144 374.7616 418.9758 458.1775 478.2756 493.5339 532.3895 573.7804 599.9605 637.4485 692.4183 699.2758 737.6620 753.8211 767.5739 807.9536 822.0271 830.8698 866.4865 893.1559 906.3955 946.1000 960.1841 985.9588 1007.1169 1012.3675 1028.3880 1074.9426 1081.5899 1097.3665 1100.9598 1151.2959 1178.5808 1183.0777 1235.2703 1276.5291 1294.6093 1316.1916 1352.7143 1369.3721 1387.1068 1394.4481 1413.6120 1448.8626 1458.3666 1463.9931 1464.7186 1479.6298 1483.5648 1519.9138 1578.3122 1610.0707 1613.0509 1628.1087 1664.8919 2984.4920 2996.0423 3034.7160 3068.8159 3091.3164 3097.8062 3123.8288 3125.6937 3129.3116 3145.6790 3168.9204 3193.3461 3478.2154
redmass: 3.8630 3.8296 5.9579 7.1140 4.8570 4.0109 4.5277 3.3207 4.7314 1.0382 1.6851 3.0990 4.2000 3.0424 4.7036 9.4521 4.5502 4.8754 3.1601 5.1186 4.6759 4.1937 4.8102 4.9576 6.3028 3.1000 5.4710 1.9506 3.6262 1.8989 2.4566 1.6068 2.8164 1.3516 5.2176 1.6570 5.6951 2.0293 1.3572 6.1670 2.7142 1.3659 1.8154 4.3291 2.2761 2.1375 1.6790 1.7564 2.6288 1.1946 1.8798 1.1256 3.3903 1.4683 1.2640 1.2564 5.4682 1.2261 3.4560 1.0898 1.0862 1.0463 1.0496 2.7439 1.0520 1.9887 5.4461 7.4595 5.9994 8.0958 9.8242 1.0376 1.0362 1.0596 1.0969 1.0975 1.1033 1.1066 1.0983 1.0914 1.0882 1.0954 1.0957 1.0766
irintensity: 0.8290 0.0622 9.3052 2.0163 0.4837 1.0222 0.0390 4.3184 0.7606 0.4855 3.7130 3.6264 4.0650 4.3334 8.2313 2.4908 0.7319 3.6743 1.2391 1.5556 2.3327 16.6850 1.2845 29.8653 7.1640 0.3931 4.9771 22.4241 13.5130 47.4602 29.5886 2.6077 3.5350 44.3851 32.6132 47.9437 25.0964 20.4511 0.4681 1.1025 74.9997 4.7165 0.2677 173.8332 130.2039 6.6453 2.0054 37.0632 35.6859 16.4286 80.2204 8.2090 136.4876 25.4590 1.3040 52.0776 56.7690 25.5236 40.0853 30.1903 14.2280 16.9018 20.8117 50.9048 14.5335 366.4491 54.9181 91.9225 29.4344 171.5286 221.5200 4.1582 15.1514 26.5165 12.7500 32.1001 1.2589 22.3553 15.7111 9.5277 8.3832 8.0325 5.2312 59.9052
temp: 298.150 k
press: 1.00000 atm
elementType: 8 8 8 8 7 6 6 6 6 6 6 6 6 6 6 6 6 1 1 1 1 1 1 1 1 1 1 1 1 1
symmnumber: 1
zpe: 605081.5 jmol-1
zpe.correction: 0.230463 hartree
zpe.thermalcorrener: 0.247408 hartree
zpe.thermalcorrenthalpy: 0.248352 hartree
zpe.thermalcorrgfe: 0.183667 hartree
zpe.sumelectzpe: -819.493001 hartree
zpe.sumelectthermal: -819.476056 hartree
zpe.sumelectthermalent: -819.475112 hartree
zpe.sumelectthermalfe: -819.539797 hartree
dipole: -2.4023 5.5447 -0.2707
dipole: 6.0488
quadrupole: -120.2586 -94.9186 -99.4052
quadrupole: -22.6329 -0.3742 -1.6510
quadrupole: -15.3978 9.9422 5.4556 -22.6329 -0.3742 -1.6510
hfenergy: -819.7234639 hartree
pointgroup: C01 [X(C12H13N1O4)]
dipole: 0.8819633 -2.1648698 -0.4458359 debye
polarizability: 239.6431823|6.8805647|164.9478097|-2.6015439|19.0224649|80.2184249 unknown
InChI: InChI=1S/C12H13NO4/c1-3-17-12(16)11(15)13-10-6-4-5-9(7-10)8(2)14/h4-7,13H,3H2,1-2H3
charge 0 multiplicity 1
30 atoms
O  3.03866 -0.992759 -0.546625
O  -5.169778 -0.934483 -0.136452
O  1.917703 2.321378 0.31962
O  4.382914 0.881563 -0.138864
N  0.813627 0.277363 -0.125821
C  -0.556886 0.621098 0.024863
C  -2.896707 -0.141957 -0.051718
C  -1.513007 -0.405812 -0.186983
C  -0.989925 1.9291 0.375024
C  -3.32486 1.167724 0.29942
C  -2.373021 2.183584 0.507582
C  -3.940822 -1.206102 -0.267159
C  1.923192 1.096838 0.021059
C  -3.496141 -2.616166 -0.644537
C  4.25737 -1.838553 -0.783722
C  3.260889 0.354775 -0.219208
C  4.784944 -2.4045 0.535991
H  -1.168658 -1.411274 -0.458051
H  -0.250431 2.715865 0.535757
H  -4.399032 1.35204 0.399163
H  -2.70207 3.192586 0.777583
H  1.033809 -0.693952 -0.37478
H  -4.386167 -3.252664 -0.759975
H  -2.842017 -3.049391 0.135215
H  -2.928806 -2.61444 -1.594095
H  3.897518 -2.624788 -1.465912
H  5.012182 -1.210355 -1.287783
H  5.63665 -3.079276 0.331827
H  5.140432 -1.597122 1.197499
H  4.006036 -2.98332 1.061282
