program: Gaussian 09
title: 000242644
version: EM64L-G09RevD.01
frameworkgroup: C1[X(C10H9NO4)]
method: RPBEPBE
basis: SDD
operation: Freq
keyword: #p
keyword: freq=noraman
keyword: PBEPBE/SDD
title: #p freq=noraman PBEPBE/SDD
converged: YES YES NO YES
title: Mulliken charges:
elementType: O O O O N C C C C C C C C C C H H H H H H H H H
charge: -0.223106 -0.191071 -0.354703 -0.241417 -0.448889 0.317820 0.508477 -0.319625 -0.355216 -0.458148 -0.344308 0.120741 -0.789902 0.124589 0.101031 0.232740 0.306222 0.245669 0.281855 0.353049 0.237252 0.237245 0.263371 0.396325
chargesum: 0.00000
title: Mulliken charges with hydrogens summed into heavy atoms:
elementType: O O O O N C C C C C C C C C C
charge: -0.223106 -0.191071 0.041622 -0.241417 -0.095840 0.317820 0.508477 -0.073955 -0.073360 -0.225408 -0.038086 0.120741 -0.052035 0.124589 0.101031
polarizability: 2.47459104e+02 -3.98236581e+00 1.30792299e+02 3.81613289e-03 8.94962917e-04 5.56063326e+01
1716.lowfreq: -5.9825 -0.0009 -0.0007 0.0005 3.7356 8.4072 43.1943 47.1701 70.2518
frequency: 43.1690 47.1382 70.2412 85.3137 90.4238 143.9720 160.0294 182.7459 214.8182 296.0581 304.0704 341.6099 384.5255 409.2515 445.0495 470.8829 503.3389 513.7583 567.0738 594.4870 622.5495 636.0682 639.9361 707.6284 745.0762 762.9522 784.4813 829.9206 840.0836 879.3517 884.5083 946.3233 961.2032 1004.0732 1013.0307 1029.7302 1059.5829 1074.5003 1128.6249 1148.2022 1191.8782 1264.3743 1278.8473 1307.7973 1337.5972 1366.8255 1376.4334 1423.9939 1449.0656 1464.4824 1499.5808 1512.9341 1568.6966 1597.4803 1617.6849 1623.8079 1637.4436 2985.2771 3069.6923 3122.4432 3126.8002 3155.8465 3160.6072 3194.7025 3446.1025 3512.1275
redmass: 5.8705 7.5927 5.0320 6.7544 7.1223 6.1677 1.0309 7.3501 5.6925 5.1700 7.0630 8.0527 4.3127 2.9405 3.8047 4.7681 10.7303 3.1457 4.9919 2.2881 5.0476 5.3724 1.3341 5.1229 3.4232 2.5885 1.7583 6.1027 1.3945 7.8903 1.3958 2.2026 1.3766 3.0934 1.4051 1.7100 2.7601 2.3447 1.3322 3.0160 1.1405 2.0190 4.0435 1.3435 2.7726 1.7508 2.4138 4.2438 1.1007 1.0496 2.0891 2.8561 5.5446 7.0509 5.8684 7.0314 8.3001 1.0376 1.0969 1.0897 1.0989 1.0907 1.0945 1.0952 1.0763 1.0644
irintensity: 0.3845 0.9967 0.0342 8.9158 0.2402 0.5076 0.5153 1.0956 9.6404 0.0441 10.4366 0.2046 11.8505 0.0017 0.3584 13.8413 5.5509 18.7263 0.6415 22.2234 62.0901 72.1030 158.4427 0.1821 0.5009 25.5997 20.2941 2.6817 86.6244 11.2263 60.6368 39.0052 1.2834 1.1518 0.0149 1.6789 355.0083 26.0701 21.1060 9.5013 57.0528 65.7043 227.1350 2.9249 142.0720 12.1658 140.6326 47.2320 27.4926 21.1957 47.1095 142.1858 197.8038 179.4107 139.8777 62.8982 181.0283 3.6411 12.9233 14.4070 14.1325 3.6611 8.2580 1.9608 67.5536 71.4680
temp: 298.150 k
press: 1.00000 atm
elementType: 8 8 8 8 7 6 6 6 6 6 6 6 6 6 6 1 1 1 1 1 1 1 1 1
symmnumber: 1
zpe: 459714.8 jmol-1
zpe.correction: 0.175096 hartree
zpe.thermalcorrener: 0.188938 hartree
zpe.thermalcorrenthalpy: 0.189882 hartree
zpe.thermalcorrgfe: 0.133219 hartree
zpe.sumelectzpe: -741.052926 hartree
zpe.sumelectthermal: -741.039084 hartree
zpe.sumelectthermalent: -741.038140 hartree
zpe.sumelectthermalfe: -741.094804 hartree
dipole: 2.0995 5.0790 0.0035
dipole: 5.4958
quadrupole: -79.5000 -91.7527 -87.4926
quadrupole: -9.2402 0.0094 0.0082
quadrupole: 6.7484 -5.5043 -1.2442 -9.2402 0.0094 0.0082
hfenergy: -741.2280224 hartree
pointgroup: C01 [X(C10H9N1O4)]
dipole: 0.8357906 1.9941599 0.0005162 debye
dipolederiv: -1.0212263 -0.1283395 0.000024 -0.4816821 -0.7571105 0.000101 0.00006 0.0000519 -0.3169733 -0.4551771 -0.0956847 0.0000724 0.7930646 -0.8226046 0.0001159 -0.0003551 0.0001292 -0.3121505 -1.2405955 0.5331611 -0.0011163 0.5174332 -0.5015179 0.0004869 -0.0014277 0.0006233 -0.3825637 -0.9457913 -0.1245456 0.0000104 -0.131634 -0.8891464 0.0010947 -0.0001019 0.0006894 -0.3126508 -1.5936498 0.2593621 -0.0000688 0.2831898 -0.4768133 0.0000794 0.0000921 0.0001189 -0.2887076 -1.1096922 0.0077406 -0.0000224 0.0707183 -0.144013 0.0000245 -0.0000057 0.0000245 -0.0198101 1.1082069 -0.0341712 0.0000352 0.1515313 0.1249359 0.0000099 -0.0001057 -0.0000045 0.119844 0.2462294 -0.0471983 0.0000041 0.0542674 0.0686321 -0.0000466 0.0000468 -0.0000446 -0.1226812 0.1865365 0.0966762 -0.0000246 -0.079805 0.0845052 -0.0000453 0.0000348 -0.0000405 -0.0920639 -0.3967569 0.0814893 -0.0000315 0.2175813 0.0300098 -0.000051 -0.0000998 -0.0000595 -0.1948655 -0.3242323 -0.0977477 0.0000108 -0.1941729 -0.0899793 -0.0000141 0.0000415 -0.0000183 -0.161217 2.0883618 -0.0265007 0.0000372 0.0990689 0.9034774 -0.0001699 -0.0000006 -0.0001488 0.1227892 -0.290325 0.2023324 -0.0000568 0.37216 -0.3295142 0.0001 -0.0001377 0.0001275 0.053213 0.8238905 -0.1711485 -0.0000282 -1.2082614 1.0771744 -0.0001276 0.0005301 -0.0001639 0.2339784 1.9415411 -0.3043792 0.0010634 -0.2837746 1.14589 -0.0018998 0.0013364 -0.0016015 0.2414472 0.0181059 -0.0996376 0.0000235 -0.088896 -0.0431121 0.0000434 0.0000093 0.0000488 0.1682633 0.1039352 0.0560455 -0.0000103 0.0224981 0.0726068 0.0000229 -0.0000137 0.0000282 0.1794795 0.0370581 0.0942995 -0.0000205 0.1067827 -0.0184146 0.0000364 -0.0000157 0.0000354 0.1412544 0.1025971 -0.0570168 0.0000133 -0.0189745 0.020098 0.0000304 0.0000124 0.0000277 0.1483774 0.3180395 0.0317441 -0.0000135 0.0652907 0.1806254 0.0000277 -0.0001217 -0.0000059 0.3088007 0.0847982 -0.0256589 0.0754111 -0.012307 0.0400664 0.0809777 0.0416078 0.093261 -0.0240338 0.0848203 -0.0256867 -0.075384 -0.0123092 0.03998 -0.0810194 -0.0415737 -0.0933071 -0.0239818 -0.1094338 -0.0131022 -0.0000032 -0.0867183 0.0863322 0.000003 0.0000075 0.0000051 0.122358 0.3427599 -0.112033 0.0000746 -0.1550512 0.1978923 0.00022 0.0001804 0.0002237 0.4118941 unknown
polarizability: 247.417335|-4.5530672|130.8340527|0.0134268|-0.0326925|55.6063474 unknown
InChI: InChI=1S/C10H9NO4/c1-6(12)7-2-4-8(5-3-7)11-9(13)10(14)15/h2-5,11,14H,1H3
charge 0 multiplicity 1
24 atoms
O  -4.533836 -1.373226 -0.000106
O  2.573305 -1.711097 0.000309
O  5.114382 -0.607547 0.001699
O  4.173984 1.52012 -0.002054
N  1.676333 0.485779 -0.000439
C  -2.553859 -0.003643 -0.000293
C  0.276929 0.273048 -0.000389
C  -1.955014 1.285709 -0.000594
C  -1.706686 -1.145629 -0.00005
C  -0.557719 1.425279 -0.000644
C  -0.307682 -1.025632 -0.000089
C  -4.041899 -0.205794 -0.000217
C  -4.951698 1.01952 -0.000553
C  2.693975 -0.45817 -0.000126
C  4.056581 0.268215 -0.000464
H  -0.106551 2.425202 -0.00087
H  0.335789 -1.907347 0.000107
H  -2.578005 2.185757 -0.000783
H  -2.180491 -2.132876 0.00018
H  2.009204 1.459653 -0.000581
H  -4.772775 1.648291 -0.892731
H  -4.772872 1.648693 0.891359
H  -6.000199 0.686156 -0.000538
H  5.975005 -0.10546 0.001667
