program: Gaussian 09
title: 000242641
version: EM64L-G09RevD.01
frameworkgroup: C1[X(C16H15N3O2)]
method: RPBEPBE
basis: SDD
operation: Freq
keyword: #p
keyword: freq=noraman
keyword: PBEPBE/SDD
title: #p freq=noraman PBEPBE/SDD
converged: YES YES NO NO
title: Mulliken charges:
elementType: O O N N N C C C C C C C C C C C C C C C C H H H H H H H H H H H H H H H
charge: -0.219712 -0.229913 -0.437471 -0.398695 -0.694967 0.067779 -0.622755 0.456177 0.175239 0.519387 0.147712 -0.372651 -0.396944 -0.370545 -0.450146 -0.250902 -0.228066 -0.422036 -0.421690 -0.239863 0.492103 0.245757 0.224258 0.347495 0.347926 0.265211 0.244113 0.245798 0.242350 0.228045 0.226987 0.218037 0.219276 0.229745 0.306335 0.306625
chargesum: 0.00000
title: Mulliken charges with hydrogens summed into heavy atoms:
elementType: O O N N N C C C C C C C C C C C C C C C C
charge: -0.219712 -0.229913 -0.089976 -0.050769 -0.082007 0.067779 -0.152741 0.456177 0.175239 0.519387 0.147712 -0.107440 -0.152831 -0.124746 -0.207795 -0.022856 -0.001079 -0.203999 -0.202414 -0.010118 0.492103
polarizability: 2.11271063e+02 4.03547467e+00 2.18287526e+02 2.97047019e+01 -1.05788713e+01 1.52317313e+02
1716.lowfreq: -4.9517 -1.1484 -0.0005 0.0003 0.0006 10.7360 27.3883 40.0932 52.7996
frequency: 27.3333 40.0705 52.7742 57.9715 61.2957 105.5584 133.9005 156.2752 163.4085 185.5383 240.5264 280.7183 314.0406 340.1714 352.3781 360.6825 377.8407 386.0921 401.8826 404.3800 413.9566 474.0162 484.1382 516.6825 527.6743 565.5960 604.0418 615.0606 616.8883 639.2199 645.8313 651.0920 688.7749 705.4117 722.0370 725.5399 743.6424 777.5804 780.9882 822.9102 828.4025 834.4110 854.6933 875.6021 920.5529 947.2684 965.6475 968.6051 975.8449 978.5870 989.9610 995.9537 1001.3696 1009.2434 1021.0237 1032.9570 1076.0794 1104.8513 1132.7069 1164.8952 1174.0640 1192.2745 1195.4810 1198.5489 1220.7217 1255.0758 1300.8179 1308.5714 1316.9968 1319.0234 1322.6978 1328.9486 1357.3449 1381.6750 1387.3846 1435.2437 1437.0378 1463.6395 1482.4306 1520.4283 1578.6165 1591.9001 1610.8442 1632.3842 1645.0577 1675.4461 1719.0359 3005.4287 3069.9923 3109.4897 3117.6805 3125.4186 3134.2674 3134.9113 3145.4687 3148.0291 3156.4079 3167.2553 3566.8294 3578.9722 3586.2300 3706.7306
redmass: 5.3232 5.2308 4.8375 4.0958 5.7568 5.9763 5.8383 5.0680 8.2567 5.8319 4.8942 5.4953 4.3719 4.7338 2.4911 1.4319 1.0553 9.3315 2.3448 2.6862 2.7092 4.6830 2.9665 2.4669 1.4612 3.7190 9.5144 5.1356 4.4339 5.7007 3.3966 1.5493 5.7502 1.8202 3.7954 6.7017 2.7684 2.6171 3.8470 1.3199 2.1462 3.3522 1.2567 2.5654 1.4403 1.3694 1.3886 3.0859 2.7717 1.4179 4.2487 1.5704 2.8841 3.9990 1.5269 2.0566 2.0440 1.9761 1.3444 1.7481 1.0578 1.1335 1.1466 3.4072 2.7935 2.0622 2.2459 1.6550 2.7226 2.0073 1.4742 1.4799 1.7165 7.7898 4.8762 2.2459 3.2309 1.1025 2.1988 3.0629 6.5356 6.1540 6.0245 2.3888 1.6669 8.7210 9.4675 1.0618 1.1009 1.0871 1.0877 1.0847 1.0959 1.0882 1.0966 1.0924 1.0955 1.1009 1.0449 1.0793 1.0806 1.1040
irintensity: 0.1425 0.0429 0.0053 0.1460 0.7061 0.3066 4.3079 1.5112 3.2438 1.6290 0.1951 5.4447 5.3626 3.5571 26.2909 268.0954 2.6457 20.6237 0.6027 0.1900 0.2487 3.0110 34.7365 27.0640 56.9189 7.7625 14.1031 5.5377 12.3792 7.2503 80.6397 119.1303 0.3244 61.2881 18.8547 41.9600 4.6404 13.5631 15.9319 7.8363 37.8241 19.2570 0.3722 19.3103 2.0518 1.4566 1.1437 10.4793 13.4419 0.6214 0.7180 1.7483 1.8719 19.4783 0.9262 6.0403 9.9401 3.8113 13.1238 8.7057 0.4248 30.3704 1.5063 66.5166 10.0435 29.9097 213.4445 29.4819 89.7376 17.8003 16.4452 21.0947 9.8076 1.7640 12.8482 16.9199 0.1820 12.5034 18.4407 120.7738 3.7665 0.1050 4.5845 10.7327 328.4326 459.8708 494.2825 23.1412 11.3228 14.2531 19.7724 0.3899 31.1687 6.7742 6.0971 18.2474 20.2036 17.3422 83.5410 63.3970 66.1744 20.8029
temp: 298.150 k
press: 1.00000 atm
elementType: 8 8 7 7 7 6 6 6 6 6 6 6 6 6 6 6 6 6 6 6 6 1 1 1 1 1 1 1 1 1 1 1 1 1 1 1
symmnumber: 1
zpe: 739575.6 jmol-1
zpe.correction: 0.281689 hartree
zpe.thermalcorrener: 0.299727 hartree
zpe.thermalcorrenthalpy: 0.300671 hartree
zpe.thermalcorrgfe: 0.234692 hartree
zpe.sumelectzpe: -931.975757 hartree
zpe.sumelectthermal: -931.957719 hartree
zpe.sumelectthermalent: -931.956775 hartree
zpe.sumelectthermalfe: -932.022755 hartree
dipole: 5.1129 2.4714 0.4874
dipole: 5.6997
quadrupole: -103.5960 -118.0740 -129.7311
quadrupole: -2.0167 6.4201 7.8556
quadrupole: 13.5377 -0.9403 -12.5974 -2.0167 6.4201 7.8556
hfenergy: -932.2574462 hartree
pointgroup: C01 [X(C16H15N3O2)]
dipole: -2.0554658 -0.871507 0.2098758 debye
polarizability: 210.0845948|6.0878996|216.6287987|-30.4348719|14.8482024|155.1625078 unknown
InChI: InChI=1S/C16H15N3O2/c17-13-8-6-11(7-9-13)10-16(12-4-2-1-3-5-12)14(20)18-15(21)19-16/h1-9,18-19H,10,17H2
charge 0 multiplicity 1
36 atoms
O  3.070878 0.567869 -1.884973
O  2.074786 3.132342 1.942179
N  0.921149 1.346564 0.861338
N  2.90847 1.958543 0.029409
N  -5.370499 0.199433 0.726912
C  1.096747 0.475564 -0.314479
C  -0.01431 0.770836 -1.3986
C  1.170954 -1.022397 0.039431
C  2.479828 0.967452 -0.854246
C  -1.425564 0.615044 -0.858528
C  1.959036 2.243417 1.066216
C  1.49032 -1.965042 -0.9729
C  0.921223 -1.482428 1.353627
C  -2.068954 -0.650417 -0.805642
C  -2.145012 1.737412 -0.36867
C  1.543321 -3.343107 -0.673511
C  0.969626 -2.863715 1.65114
C  -3.368376 -0.794088 -0.286002
C  -3.445924 1.611467 0.158322
C  1.2763 -3.799934 0.638816
C  -4.081467 0.33702 0.210349
H  0.171731 0.094783 -2.251321
H  0.142851 1.804019 -1.761846
H  0.029591 1.439687 1.347438
H  3.786458 2.471259 -0.055764
H  1.730267 -1.61746 -1.983405
H  0.701182 -0.763601 2.149199
H  -1.542581 -1.537921 -1.175925
H  -1.685924 2.7335 -0.416365
H  1.799961 -4.058944 -1.462418
H  0.770838 -3.205116 2.673238
H  -3.840356 -1.784195 -0.263067
H  -3.977756 2.499495 0.521573
H  1.315615 -4.870323 0.869843
H  -5.882594 1.005387 1.072709
H  -5.825013 -0.708209 0.758018
