program: Gaussian 09
title: 000242593
version: EM64L-G09RevD.01
frameworkgroup: C1[X(C18H15N3O)]
method: RPBEPBE
basis: SDD
operation: Freq
keyword: #p
keyword: freq=noraman
keyword: PBEPBE/SDD
title: #p freq=noraman PBEPBE/SDD
converged: YES YES NO NO
title: Mulliken charges:
elementType: O N N N C C C C C C C C C C C C C C C C C C H H H H H H H H H H H H H H H
charge: -0.215505 0.021026 -0.421071 -0.001339 0.372422 0.395605 0.357103 -0.556197 -0.443399 -0.392387 0.062610 -0.413940 -0.410819 -0.242372 -0.238391 -0.805317 0.274085 0.176078 -0.283591 -0.315254 -0.322496 -0.327711 0.295807 0.235772 0.213178 0.248901 0.239397 0.230450 0.229039 0.249677 0.227370 0.258867 0.313652 0.272216 0.224570 0.248018 0.243948
chargesum: 0.00000
title: Mulliken charges with hydrogens summed into heavy atoms:
elementType: O N N N C C C C C C C C C C C C C C C C C C
charge: -0.215505 0.021026 -0.107419 -0.001339 0.372422 0.395605 0.357103 -0.260390 -0.207626 -0.179209 0.062610 -0.165039 -0.171422 -0.011922 -0.009352 -0.069403 0.274085 0.176078 -0.011376 -0.090684 -0.074479 -0.083764
polarizability: 4.53396768e+02 -1.16970159e+01 2.30265021e+02 2.16814463e+00 3.79350965e+00 1.02073732e+02
1716.lowfreq: -8.6725 -0.0005 0.0006 0.0007 1.2560 2.9487 17.5354 25.7741 37.2437
frequency: 17.3719 25.6892 37.2052 41.1085 75.9873 88.1683 95.8534 117.4730 167.3572 181.8322 205.5531 228.5653 245.3972 314.4784 337.4482 340.3887 364.2287 372.6431 401.9605 417.5082 473.8246 478.2451 488.7221 515.0610 527.4531 553.1270 574.9868 611.8536 621.4437 650.7001 659.2671 663.6922 690.1389 700.8998 752.4915 760.1103 760.6428 787.7356 824.7827 834.3345 840.0811 878.9003 886.9364 889.2341 934.1561 944.4805 957.0322 961.4330 964.2670 975.5103 978.0092 986.4397 994.6284 1020.8517 1027.8623 1035.4412 1061.4632 1076.2645 1086.7151 1132.3440 1133.4703 1171.3166 1174.7097 1217.1736 1221.5153 1242.5129 1247.2118 1277.6328 1299.6099 1317.9615 1325.4326 1352.2010 1390.3254 1399.1114 1406.5815 1421.2351 1436.7343 1447.9569 1460.2522 1464.4744 1483.0842 1504.7879 1520.1622 1540.0049 1546.4122 1574.5406 1580.2933 1602.6013 1620.8214 1636.9829 2965.3751 3034.2952 3121.2657 3123.0822 3123.2624 3126.9755 3129.4716 3141.5880 3144.6391 3147.8834 3150.1615 3153.7458 3163.3801 3174.0813 3421.3059
redmass: 5.6481 4.6018 5.6882 4.2325 3.3029 1.6179 5.8526 3.0038 6.6791 3.6654 5.5135 5.1246 5.0927 4.1393 4.2150 4.8241 2.5480 5.0193 3.4742 4.9557 3.1749 2.6491 3.9582 6.7332 4.2135 2.7299 5.3048 1.6942 4.9145 6.6774 6.2361 2.7293 4.3798 4.6207 2.9094 1.3271 4.7910 2.6643 1.3955 1.9370 3.6403 1.5565 4.0980 1.2618 5.0434 1.4350 3.1581 1.4564 1.9549 2.6137 1.5088 1.4523 1.3558 2.2897 1.5873 2.7415 2.0909 2.4915 1.6993 1.8032 3.1597 1.1673 1.1572 1.3946 1.7247 2.9885 1.6801 1.7085 6.4245 2.8876 1.5636 1.9163 1.2361 1.8507 4.7109 2.9970 4.9883 1.3028 1.8632 2.0407 1.1810 1.9130 2.0679 6.2602 7.2030 7.3039 5.6966 5.6513 8.5843 6.8802 1.0418 1.0975 1.0866 1.0880 1.0884 1.0909 1.0883 1.0897 1.0952 1.0972 1.0923 1.0950 1.1004 1.0966 1.0746
irintensity: 0.8952 0.1870 0.5636 2.2389 0.3407 6.3433 1.6221 2.1276 4.8474 1.8112 2.7960 5.9079 5.5549 2.5856 3.3431 2.6941 0.0597 1.4068 1.5186 9.3578 3.7830 27.5094 0.8882 0.5813 5.9760 11.6827 5.0286 53.6291 5.8379 30.8066 1.5808 1.9558 30.9667 10.5138 9.0509 47.3372 0.5393 0.5708 57.8682 33.3255 5.7159 13.6142 28.2704 4.4187 19.4907 10.7879 1.1016 4.0678 0.8906 16.8683 17.1925 1.0306 0.3645 5.3915 1.6567 2.2601 12.0534 1.2366 19.0092 47.3719 90.2384 0.1843 0.1839 24.0416 22.8960 215.5256 21.5185 6.3190 0.0875 34.0886 7.2385 6.5458 27.8433 13.9969 1.1144 7.3197 10.1748 172.7603 1.8332 28.1219 81.1249 132.0617 43.9431 15.2110 25.9643 1.6571 17.4230 5.7650 174.1560 3.0803 15.2853 15.7141 0.8634 25.4920 5.9147 1.7437 0.7868 31.5572 25.5926 13.9923 10.5805 23.7317 41.7067 6.3981 15.4873
temp: 298.150 k
press: 1.00000 atm
elementType: 8 7 7 7 6 6 6 6 6 6 6 6 6 6 6 6 6 6 6 6 6 6 1 1 1 1 1 1 1 1 1 1 1 1 1 1 1
symmnumber: 1
zpe: 752304.0 jmol-1
zpe.correction: 0.286537 hartree
zpe.thermalcorrener: 0.305062 hartree
zpe.thermalcorrenthalpy: 0.306006 hartree
zpe.thermalcorrgfe: 0.236998 hartree
zpe.sumelectzpe: -932.859004 hartree
zpe.sumelectthermal: -932.840479 hartree
zpe.sumelectthermalent: -932.839535 hartree
zpe.sumelectthermalfe: -932.908544 hartree
dipole: 2.1695 4.6278 0.1311
dipole: 5.1127
quadrupole: -131.0478 -115.1938 -131.2711
quadrupole: -4.8118 0.4875 0.6216
quadrupole: -5.2102 10.6437 -5.4335 -4.8118 0.4875 0.6216
hfenergy: -933.1455414 hartree
pointgroup: C01 [X(C18H15N3O1)]
dipole: -0.8521823 -1.8217487 0.0344688 debye
polarizability: 453.2247653|-11.5723123|230.3467119|-8.3703224|-1.3657218|102.164044 unknown
InChI: InChI=1S/C18H15N3O/c1-13(20-21-18(22)15-8-10-19-11-9-15)16-7-6-14-4-2-3-5-17(14)12-16/h2-12,21H,1H3
charge 0 multiplicity 1
37 atoms
O  2.292959 1.982513 -0.28702
N  0.482839 -0.156919 -0.1506
N  1.856528 -0.326894 -0.147589
N  6.992761 -0.023447 -0.098626
C  -3.644412 0.584971 0.128825
C  -4.58599 -0.485551 -0.138851
C  -1.752456 -0.98978 -0.1327
C  -2.245949 0.304789 0.123627
C  -4.068966 -1.79449 -0.407054
C  -2.69684 -2.042779 -0.402908
C  -0.285159 -1.239116 -0.132749
C  -4.150213 1.903196 0.396357
C  -5.99043 -0.199799 -0.128886
C  -5.523465 2.152146 0.399059
C  -6.451643 1.092311 0.134774
C  0.276833 -2.654103 -0.103581
C  4.174563 0.455921 -0.14651
C  2.702638 0.795437 -0.192625
C  5.082624 1.373678 -0.73075
C  4.710299 -0.6970 0.484266
C  6.464607 1.092506 -0.689931
C  6.111001 -0.889397 0.482556
H  -1.527201 1.107433 0.319263
H  -4.771538 -2.608295 -0.622544
H  -2.34452 -3.053653 -0.632233
H  -3.437467 2.711746 0.596438
H  -6.699693 -1.011148 -0.332059
H  -5.89989 3.160468 0.602696
H  -7.526793 1.302905 0.140225
H  0.751607 -2.926379 -1.067462
H  1.040487 -2.761377 0.693042
H  -0.5009 -3.400456 0.107173
H  2.282007 -1.26201 -0.195655
H  4.698409 2.286656 -1.194968
H  4.075303 -1.418209 1.011452
H  7.189572 1.778288 -1.141613
H  6.554789 -1.764861 0.969967
