program: Gaussian 09
title: 000242578
version: EM64L-G09RevD.01
frameworkgroup: C1[X(C10H7N5O3)]
method: RPBEPBE
basis: SDD
operation: Freq
keyword: #p
keyword: freq=noraman
keyword: PBEPBE/SDD
title: #p freq=noraman PBEPBE/SDD
converged: NO YES NO NO
title: Mulliken charges:
elementType: O O O N N N N N C C C C C C C C C C H H H H H H H
charge: -0.258722 -0.276168 -0.241695 -0.042570 -0.340666 -0.326301 -0.328918 -0.040472 0.147541 0.011383 0.172892 -0.018389 0.174878 -0.337026 0.282223 -0.328950 -0.253049 -0.168143 0.289050 0.341978 0.345458 0.354378 0.322338 0.256347 0.262604
chargesum: 0.00000
title: Mulliken charges with hydrogens summed into heavy atoms:
elementType: O O O N N N N N C C C C C C C C C C
charge: -0.258722 -0.276168 -0.241695 -0.042570 0.001313 0.019156 0.025460 -0.040472 0.147541 0.011383 0.172892 -0.018389 0.174878 -0.047976 0.282223 -0.006612 0.003297 0.094461
polarizability: 3.06516770e+02 -2.06595352e+01 1.63716826e+02 -1.60783953e-02 5.97313439e-03 5.90812597e+01
1716.lowfreq: -9.8216 -0.0006 0.0003 0.0003 2.2253 2.7380 37.1273 63.0019 73.1214
frequency: 37.1057 62.9379 73.1213 95.0402 112.7883 154.3918 203.7344 215.3158 242.2760 258.6934 310.1903 344.3152 357.1619 376.0339 438.8049 453.2012 468.8441 530.9805 548.0960 581.2073 589.6951 590.3840 628.8745 661.5764 688.6393 693.6391 703.0427 717.6409 741.3794 772.2409 783.6709 808.2691 833.5313 867.9388 890.1964 915.9386 924.9192 970.4170 999.6459 1041.1994 1058.0238 1062.3897 1131.8617 1148.5745 1206.0082 1222.8182 1234.1469 1271.6858 1305.0961 1342.7954 1354.4359 1373.2487 1388.4633 1431.6522 1469.6177 1477.2695 1495.2560 1553.0853 1565.5317 1610.7648 1614.5630 1634.4234 3161.9365 3226.2032 3259.8908 3274.8012 3535.8964 3540.3914 3551.2891
redmass: 8.1058 4.9522 6.8685 8.0408 6.4744 6.7152 8.1388 7.9647 6.4244 8.1203 3.8718 10.1787 1.5353 8.5345 3.5243 10.8557 9.9762 2.5040 8.6868 3.1615 1.5641 5.3109 4.3342 1.3717 8.2602 5.6725 1.3225 8.9991 8.4761 5.9415 7.8237 8.1801 1.2466 6.8740 1.3135 6.5741 3.6486 1.4466 2.0172 2.4746 3.9442 4.8535 1.4981 2.7370 3.3846 2.4114 1.9504 4.0745 5.0487 3.9124 2.4382 2.1453 2.1456 2.4921 2.3385 7.3275 4.9836 3.6008 6.5778 9.0697 5.2243 7.1409 1.0937 1.0927 1.0996 1.1082 1.0759 1.0796 1.0797
irintensity: 1.1442 0.0053 0.3912 7.5563 3.9317 1.8607 3.7388 1.0306 0.1562 0.4707 2.8288 14.8633 1.5488 14.9514 22.8018 1.2486 0.7924 22.5429 3.1187 36.1634 190.4392 1.5547 0.3345 124.8562 7.2686 5.3875 60.5530 0.8051 32.9167 4.2750 14.9618 10.2389 45.7614 6.2930 4.3222 0.1732 8.6660 10.2083 41.3584 21.8675 72.5577 68.3230 6.1201 13.5925 6.6439 45.0168 1.7096 32.2718 62.7364 46.6294 4.7502 56.6877 8.4274 45.7099 38.4632 93.0475 29.4103 19.3150 1185.8886 146.0518 530.0734 16.7952 0.2708 4.6080 5.3736 0.0201 128.5977 12.7081 162.4620
temp: 298.150 k
press: 1.00000 atm
elementType: 8 8 8 7 7 7 7 7 6 6 6 6 6 6 6 6 6 6 1 1 1 1 1 1 1
symmnumber: 1
zpe: 449731.3 jmol-1
zpe.correction: 0.171294 hartree
zpe.thermalcorrener: 0.185584 hartree
zpe.thermalcorrenthalpy: 0.186528 hartree
zpe.thermalcorrgfe: 0.129208 hartree
zpe.sumelectzpe: -883.407878 hartree
zpe.sumelectthermal: -883.393588 hartree
zpe.sumelectthermalent: -883.392643 hartree
zpe.sumelectthermalfe: -883.449964 hartree
dipole: 0.7179 1.5333 0.0000
dipole: 1.6931
quadrupole: -81.4564 -106.4816 -104.7421
quadrupole: 18.7523 0.0018 -0.0007
quadrupole: 16.1036 -8.9215 -7.1821 18.7523 0.0018 -0.0007
hfenergy: -883.5791718 hartree
pointgroup: C01 [X(C10H7N5O3)]
dipole: -0.2756739 -0.6063809 -0.000016 debye
dipolederiv: -0.1960776 0.0435771 -0.000002 -0.1698083 -0.6301182 -0.0000152 -0.0000013 0.0000107 -0.1311813 -1.1961944 0.4243506 -0.0000983 0.5012234 -0.9210766 0.0000981 0.0002643 -0.0002435 -0.370728 -0.652865 0.2354651 0.0001427 0.2503401 -0.9549482 -0.0001502 -0.0002937 0.0003272 -0.3392972 -1.2911838 0.02134 -0.0001143 -1.1165688 -0.3107344 -0.0000904 -0.0001184 -0.0000149 -0.1882628 -0.6735623 -0.4836565 -0.0001743 0.182753 -0.5227859 -0.0002583 -0.000511 -0.0001532 -0.3173521 -0.3182682 0.3392335 0. -0.5873565 -0.2674872 0.000095 0.0004869 0.0000823 -0.3025314 -1.7579622 0.1305903 -0.0001212 -0.2813629 -0.3025315 -0.0000179 -0.0001712 0.0000079 -0.2628854 -1.2951565 -0.0930041 -0.0000782 0.4475115 -0.3762688 0.0000552 -0.0000877 -0.0000501 -0.2437507 -1.263188 0.0570173 -0.0000736 -0.2407455 -0.4838167 0.0000144 -0.0001468 -0.000083 0.0487998 1.1146812 -0.1507999 0.0001335 0.0640101 0.1328762 0.0000146 0.0000041 -0.0000035 0.0986547 1.9035343 -0.1159403 0.0001628 -0.3193413 1.4513837 0.0000133 -0.0000897 0.0001475 0.2470125 2.4176428 0.0008774 0.0001996 0.7902342 0.1959706 0.0000645 0.0002261 0.0000205 0.2051026 1.0384828 -0.4756367 -0.0001208 -0.1223732 0.9648649 0.0000814 0.0002839 -0.0002035 0.1941874 0.8702083 0.1254475 0.0000676 0.3825188 0.4614759 -0.0000041 0.0000197 0.000036 0.0045943 0.7189896 -0.1712085 0.0000496 -0.1299999 0.5623214 -0.0000151 0.0000719 -0.0000192 0.0736372 0.0981443 -0.014741 0.0000328 -0.0133464 -0.2211626 0.0000001 0.0000275 -0.0000011 -0.1892518 -0.1869972 -0.0813343 0.0000031 -0.1952751 0.0046764 -0.0000201 0.0000108 -0.0000118 -0.1894332 -0.2738016 -0.0104257 -0.0000062 0.2668139 0.3384784 0.0000213 -0.0000231 -0.000009 -0.174759 0.0685166 0.0685554 -0.00001 0.0346231 0.0643471 0.0000095 0.0000126 0.0000182 0.1178545 0.2722466 0.0390805 0.0000646 0.0453481 0.1395706 0.0000767 0.0002384 0.0001495 0.3777263 0.1848159 0.061943 0.0000064 0.0891236 0.1952839 0.0000138 -0.0001309 -0.0000205 0.3736405 0.2056989 0.0513257 -0.0000171 0.1299174 0.2590244 0.0000103 -0.0000276 0.0000106 0.3327336 0.116815 -0.0489105 -0.0000123 -0.0703001 0.1251926 -0.0000048 -0.0000131 -0.000006 0.20581 0.0691558 0.0583331 -0.0000123 0.0923222 0.0041347 0.0000105 -0.0000134 0.0000076 0.1945751 0.0263248 -0.0114789 -0.000022 -0.0302612 0.091329 -0.0000024 -0.0000182 0.000001 0.2351046 unknown
polarizability: 306.9616778|-19.0548046|163.2719173|0.0161443|-0.0057926|59.0812597 unknown
InChI: InChI=1S/C10H7N5O3/c16-8-5-4-11-10(12-6-2-1-3-18-6)13-7(5)9(17)15-14-8/h1-4,12,14-15H
charge 0 multiplicity 1
25 atoms
O  4.265192 0.906766 0.000307
O  -4.413786 1.471355 -0.000107
O  -0.983988 -2.859769 0.000238
N  0.164545 -0.230771 -0.000104
N  -3.972976 -0.801913 -0.000174
N  -3.086105 -1.90102 -0.000024
N  1.962062 1.299276 0.000061
N  -0.179789 2.211626 -0.000192
C  -2.090827 0.699908 -0.000379
C  -1.184411 -0.397519 -0.000242
C  -3.558759 0.532189 -0.000477
C  0.607265 1.065531 -0.000113
C  -1.692207 -1.813858 -0.000447
C  -1.511799 2.006479 -0.000316
C  2.975439 0.340739 0.00017
C  3.044003 -1.04451 0.000202
C  4.457303 -1.370985 0.000346
C  5.16827 -0.185559 0.00042
H  -2.162834 2.886294 -0.000393
H  -4.974522 -1.008534 0.000486
H  -3.50684 -2.833583 0.000013
H  2.241904 2.284228 0.000097
H  2.191846 -1.717408 0.000102
H  4.881647 -2.373075 0.000394
H  6.220469 0.082016 0.000529
