program: Gaussian 09
title: 000242576
version: EM64L-G09RevD.01
frameworkgroup: C1[X(C6H5N5O2)]
method: RPBEPBE
basis: SDD
operation: Freq
keyword: #pfreq=noraman
keyword: PBEPBE/SDD
title: #p freq=noraman PBEPBE/SDD
converged: NO YES NO NO
title: Mulliken charges:
elementType: O O N N N N N C C C C C C H H H H H
charge: -0.278516 -0.237320 -0.339539 -0.330250 -0.028539 -0.035506 -0.572035 0.141719 -0.001326 0.175586 0.183131 -0.313803 -0.024911 0.340773 0.344300 0.286738 0.347069 0.342431
chargesum: 0.00000
title: Mulliken charges with hydrogens summed into heavy atoms:
elementType: O O N N N N N C C C C C C
charge: -0.278516 -0.237320 0.001234 0.014050 -0.028539 -0.035506 0.117464 0.141719 -0.001326 0.175586 0.183131 -0.027065 -0.024911
polarizability: 1.59115843e+02 -9.05919183e+00 1.26154443e+02 1.96493169e-04 1.28685300e-02 4.24204615e+01
1716.lowfreq: -0.0008 -0.0008 -0.0001 6.0967 11.3637 12.5545 74.3663 99.6791 151.6992
frequency: 74.3595 99.6764 151.6986 210.8231 212.7768 244.8391 327.2236 352.3910 372.0930 430.3942 450.5850 460.5353 523.3469 525.6845 558.9744 573.3156 590.5255 591.0808 693.4033 693.9731 713.5245 749.5152 778.6983 812.5846 882.3565 973.8261 1009.4069 1061.3053 1067.1891 1211.4482 1249.5977 1287.4236 1314.0227 1352.0888 1378.6538 1390.9294 1462.4910 1479.4882 1499.2185 1568.0796 1609.4467 1621.1654 1636.6511 3157.4200 3543.0656 3547.5406 3553.7779 3705.9008
redmass: 5.4373 9.2934 6.1984 6.3342 7.1330 5.6715 10.6430 1.4229 4.3332 3.1507 10.4272 5.7454 9.0361 1.6994 1.4539 1.0775 1.7579 4.4655 8.4161 8.6093 7.0331 11.5919 7.7397 9.7389 5.4952 1.4586 2.2888 5.6724 3.3865 2.9806 2.6385 5.5768 3.8918 2.7984 2.1224 2.7303 2.1018 5.8908 3.2791 4.9784 2.4837 2.7743 7.1560 1.0937 1.0796 1.0449 1.0792 1.1060
irintensity: 7.2343 6.4832 4.1595 3.1893 0.0985 0.6345 15.7421 1.1117 3.4527 29.6077 3.9176 5.7406 6.9078 18.8468 310.8513 103.7766 103.1864 11.4622 18.2520 10.2542 0.2448 20.1274 7.0224 16.4130 2.4031 8.3927 15.3920 15.2923 106.4457 19.0531 40.4131 37.1974 54.7455 8.3224 34.4060 13.4165 51.4515 52.3476 56.2609 269.5847 888.5924 298.3068 21.5337 0.5516 8.4777 209.9630 110.1998 59.5908
temp: 298.150 k
press: 1.00000 atm
elementType: 8 8 7 7 7 7 7 6 6 6 6 6 6 1 1 1 1 1
symmnumber: 1
zpe: 321523.4 jmol-1
zpe.correction: 0.122462 hartree
zpe.thermalcorrener: 0.132907 hartree
zpe.thermalcorrenthalpy: 0.133852 hartree
zpe.thermalcorrgfe: 0.086404 hartree
zpe.sumelectzpe: -654.926307 hartree
zpe.sumelectthermal: -654.915862 hartree
zpe.sumelectthermalent: -654.914918 hartree
zpe.sumelectthermalfe: -654.962365 hartree
dipole: 0.0574 0.5434 0.0001
dipole: 0.5464
quadrupole: -42.8042 -95.2570 -74.9085
quadrupole: 6.7094 -0.0092 -0.0081
quadrupole: 28.1857 -24.2671 -3.9186 6.7094 -0.0092 -0.0081
hfenergy: -655.0487692 hartree
pointgroup: C01 [X(C6H5N5O2)]
dipole: -0.0212801 -0.2139268 0.0000208 debye
dipolederiv: -0.7092682 0.2881226 0.000251 0.3305843 -1.2295867 -0.0010597 -0.0011058 0.0032585 -0.3737223 -0.4947747 0.0447546 -0.0006897 0.1561114 -1.2121018 0.0021591 0.0015496 -0.0047896 -0.3435382 -0.6081536 -0.5161623 0.0004132 0.2836646 -0.454577 0.0007972 -0.0009802 -0.0018404 -0.3183982 -0.4272263 0.4351754 0.0017217 -0.4614591 -0.2382149 -0.0010016 0.0005844 0.0016968 -0.3098115 -1.2809891 0.264608 0.000454 -0.4263903 -0.2761544 0.0001196 0.001508 0.0000026 -0.2212015 -0.876532 -0.0353504 0.0002428 0.6101866 -0.4270228 -0.0002547 0.0001954 0.0005677 -0.2525469 -1.6780246 0.297094 0.0000612 0.4058117 -0.1974227 -0.0005735 0.0006662 -0.0006425 -0.6805462 -0.8717015 0.0465683 0.0000668 0.0754766 -0.5638286 0.0002864 0.0015154 0.0011944 0.0524462 0.7328463 -0.3565333 -0.0004044 -0.2007214 0.2464921 -0.0001361 0.0004958 -0.000378 0.1042929 1.3306301 0.1099204 -0.0003742 -0.2980449 1.6146248 0.0006941 0.0002698 -0.0018079 0.2484379 0.8222176 -0.4322984 0.0002816 -0.1738868 1.3672444 -0.0014616 -0.0018305 0.0031124 0.1928198 0.7528084 0.1780335 -0.0004114 0.0538237 0.3988849 -0.0001723 -0.0001786 -0.0008896 0.0119309 2.1406811 -0.3700133 -0.0009097 -0.3694588 0.301798 0.0002642 -0.0019132 0.0003586 0.241645 0.2556828 -0.006202 -0.0003731 -0.0065521 0.1199072 -0.0000206 0.0000183 0.0002308 0.3791177 0.2257395 0.047756 -0.0006726 0.055712 0.1459434 0.0000787 -0.0009399 -0.0002988 0.3755743 0.1082968 0.0498908 -0.0000165 0.0248703 0.0212966 0.000006 -0.0002605 0.0000009 0.11364 0.2565362 -0.0510101 0.0002192 -0.1340708 0.2176968 0.0001644 0.0002979 0.0001389 0.3900574 0.3212311 0.0056462 0.00014 0.0743431 0.1650208 0.0001105 0.0001078 0.0000852 0.3898025 unknown
polarizability: 159.2240052|-8.8595748|126.0462803|-0.0001188|-0.0128695|42.4204615 unknown
InChI: InChI=1S/C6H5N5O2/c7-6-8-1-2-3(9-6)5(13)11-10-4(2)12/h1,10-11H,7H2
charge 0 multiplicity 1
18 atoms
O  -2.09234 2.39833 -0.001629
O  -0.681217 -2.943234 -0.00157
N  -2.596311 0.139158 -0.000566
N  -2.219211 -1.222703 0.000422
N  1.431883 -0.982948 0.001625
N  2.083161 1.397315 -0.000586
N  3.674573 -0.324981 -0.000772
C  -0.270655 0.763496 0.001756
C  0.127385 -0.60581 0.002335
C  -1.68412 1.195404 0.002548
C  -0.905258 -1.700988 0.004902
C  0.774717 1.731025 0.000098
C  2.356715 0.034336 0.000422
H  -3.596883 0.349315 -0.003412
H  -2.975271 -1.911619 -0.003165
H  0.524221 2.796901 -0.0005
H  3.917459 -1.313206 -0.000455
H  4.38735 0.400808 -0.002054
