program: Gaussian 09
title: 000242574
version: EM64L-G09RevD.01
frameworkgroup: C1[X(C7H8N2O2)]
method: RPBEPBE
basis: SDD
operation: Freq
keyword: #pfreq=noraman
keyword: PBEPBE/SDD
title: #p freq=noraman PBEPBE/SDD
converged: YES YES NO NO
title: Mulliken charges:
elementType: O O N N C C C C C C C H H H H H H H H
charge: -0.350039 -0.255289 0.041375 -0.620637 0.327065 0.160878 -0.318164 -0.356955 -0.769201 -0.221692 0.139892 0.240973 0.302674 0.236231 0.211490 0.273662 0.283355 0.333666 0.340714
chargesum: 0.00000
title: Mulliken charges with hydrogens summed into heavy atoms:
elementType: O O N N C C C C C C C
charge: -0.350039 -0.255289 0.041375 0.053743 0.327065 0.160878 -0.077191 -0.054281 -0.047817 0.061663 0.139892
polarizability: 1.34273434e+02 -1.11530579e+01 1.14990141e+02 7.87976121e-01 -1.49071330e+00 4.93589631e+01
1716.lowfreq: -13.5197 -2.6054 -0.0007 -0.0006 -0.0001 6.0891 62.7293 104.0240 122.9930
frequency: 62.7098 104.0217 122.9914 148.5405 186.6023 295.9914 311.7584 370.4730 388.4381 441.9253 466.1809 489.4377 533.1078 551.5796 617.3481 625.2115 689.1653 718.4202 752.5964 774.6746 822.1304 872.7244 926.1073 941.0124 1002.4531 1040.8590 1051.6571 1089.8035 1136.6349 1213.4772 1240.8850 1268.4112 1290.8087 1342.2411 1406.8212 1426.0213 1451.3772 1465.4538 1471.1015 1518.4001 1581.4745 1612.7745 1636.4251 2990.9278 3073.5425 3096.2173 3155.5692 3195.0764 3212.3414 3516.3736 3670.8411
redmass: 5.8422 1.4276 2.1190 4.5439 4.9239 3.8588 4.3519 5.2738 4.0694 3.4615 6.0703 2.6907 1.3192 2.2194 1.9708 2.6903 3.2881 5.9411 4.6373 4.9540 1.3724 1.5443 4.0781 1.3155 1.5633 1.5565 2.1136 2.4802 1.4651 2.1314 6.6704 2.3577 1.9946 4.6322 1.2111 2.8325 1.1105 1.3182 2.4674 4.1038 2.1330 3.2006 2.9337 1.0368 1.0962 1.1008 1.0909 1.0925 1.0963 1.0449 1.1045
irintensity: 14.0336 0.4586 2.5832 3.6229 9.5423 0.0123 8.6634 5.3850 0.3638 3.3306 5.7601 17.3147 103.1572 44.5927 73.8049 43.0613 19.1639 2.1306 25.7463 9.3588 36.8027 28.0585 0.5793 0.0652 2.1865 6.7784 4.4927 27.0522 5.7221 23.9609 71.9680 22.5258 9.1222 188.1001 26.2028 20.0370 26.5958 30.2094 33.9395 10.0838 106.0646 71.7717 203.0817 19.9681 12.3484 18.3745 8.9109 0.5824 0.0682 45.5436 31.5636
temp: 298.150 k
press: 1.00000 atm
elementType: 8 8 7 7 6 6 6 6 6 6 6 1 1 1 1 1 1 1 1
symmnumber: 1
zpe: 379043.5 jmol-1
zpe.correction: 0.144370 hartree
zpe.thermalcorrener: 0.154472 hartree
zpe.thermalcorrenthalpy: 0.155416 hartree
zpe.thermalcorrgfe: 0.108694 hartree
zpe.sumelectzpe: -530.656518 hartree
zpe.sumelectthermal: -530.646416 hartree
zpe.sumelectthermalent: -530.645472 hartree
zpe.sumelectthermalfe: -530.692194 hartree
dipole: -1.5188 0.8285 2.5515
dipole: 3.0828
quadrupole: -78.3694 -52.7958 -65.8166
quadrupole: 14.7077 -4.6943 -2.9608
quadrupole: -12.7088 12.8648 -0.1560 14.7077 -4.6943 -2.9608
hfenergy: -530.8008879 hartree
pointgroup: C01 [X(C7H8N2O2)]
dipole: 0.5634038 -0.5824768 0.9024038 debye
dipolederiv: -0.8272104 0.4242174 0.0447422 0.4986016 -0.7154583 -0.0352353 0.0591945 -0.0411217 -0.3363621 -0.874534 0.1030223 0.2742461 -0.047165 -0.5430995 -0.1889333 0.0747189 -0.2479638 -0.6369054 0.6370722 -0.6178435 -0.0715754 -0.6710291 0.519572 0.0400149 -0.0931424 0.0400868 0.1117232 -0.439323 -0.1272873 -0.2753783 -0.1144717 -0.9348166 -0.2505578 -0.2446684 -0.2124406 -0.7742092 0.038389 -0.3255418 -0.0470588 -0.2237091 0.0655876 0.0068979 -0.0127227 0.050451 -0.0271819 -0.2750372 -0.1943348 -0.0047805 0.0853375 0.050184 -0.0248301 0.0414549 -0.0218766 -0.0164364 0.0551709 0.2252416 0.0305252 -0.0343834 0.0938405 0.0226779 -0.0185807 0.0216437 -0.1025943 -0.1733602 0.3226248 0.0393708 -0.1603988 0.0073568 -0.0093123 -0.093531 -0.0228458 -0.1444263 -0.1325622 0.2098298 0.0394032 0.0908579 0.0394123 -0.0157438 0.0646724 -0.0461364 0.0172259 0.0876536 -0.0713871 -0.0080804 0.3352367 -0.1342677 0.0060847 0.0527381 -0.0006135 -0.1214861 1.2378773 0.1891996 -0.1018062 0.3000463 0.9307306 0.667008 0.0556813 0.6544447 0.9061263 0.0909362 -0.0286515 -0.0052609 -0.0616299 -0.0665861 -0.0277205 -0.0075964 -0.0242522 0.1450775 0.0709029 0.0022213 -0.0037342 -0.026927 0.0327028 -0.0158518 0.018616 -0.0205542 0.1696565 0.0102934 0.0367005 -0.096002 0.0294434 0.0552415 -0.0404256 -0.120339 0.0133812 -0.0215864 0.0272147 -0.1571232 -0.0112612 -0.0346424 -0.1293819 -0.0105701 -0.0081178 0.0076051 0.1138293 0.0710964 0.0396137 0.0748928 0.0374812 0.0828969 0.0422988 0.0770439 0.0009734 0.0022233 0.021064 -0.0151366 -0.0030655 0.0205933 0.0790721 -0.0122188 0.0058311 -0.0141784 0.1842051 0.18368 -0.002142 0.0719302 0.009588 0.2891285 -0.0654231 0.0976712 -0.0578329 0.2611399 0.1906764 -0.0132231 0.0528932 -0.0328295 0.2778845 -0.0881597 0.0510761 -0.0787697 0.2699811 unknown
polarizability: 132.293066|-12.2559494|113.2157639|-2.9614146|15.5655946|53.1137082 unknown
InChI: InChI=1S/C7H8N2O2/c1-5-2-3-9(11)4-6(5)7(8)10/h2-4H,8H2,1H3
charge 0 multiplicity 1
19 atoms
O  -2.782137 1.560169 0.298602
O  2.874131 0.015063 -0.587697
N  -1.833557 0.630104 0.185156
N  2.241454 1.51772 1.063724
C  0.224293 -1.362255 -0.062865
C  0.538147 0.019806 0.129149
C  -1.157782 -1.683053 -0.105925
C  -0.485465 0.977871 0.239445
C  1.275415 -2.440315 -0.210761
C  -2.158431 -0.713807 0.013911
C  1.97353 0.499162 0.161128
H  -1.470225 -2.723424 -0.240003
H  -0.314742 2.051801 0.330494
H  2.011194 -2.413291 0.613471
H  0.807517 -3.439363 -0.229116
H  1.857785 -2.296138 -1.137177
H  -3.229169 -0.918466 -0.018494
H  1.556956 1.832757 1.749152
H  3.188388 1.895958 1.093308
