program: Gaussian 09
title: 000242571
version: EM64L-G09RevD.01
frameworkgroup: C1[X(C14H10N2S)]
method: RPBEPBE
basis: SDD
operation: Freq
keyword: #p
keyword: freq=noraman
keyword: PBEPBE/SDD
title: #p freq=noraman PBEPBE/SDD
converged: NO YES NO NO
title: Mulliken charges:
elementType: S N N C C C C C C C C C C C C C C H H H H H H H H H H
charge: 0.212568 -0.035180 0.045120 0.363084 0.073772 -0.368599 -0.324016 -0.318545 -0.126977 -0.239537 -0.208303 -0.221494 -0.225277 -0.405084 -0.212552 -0.211373 -0.225625 0.246752 0.263662 0.233836 0.236390 0.251915 0.252323 0.249112 0.231296 0.231333 0.231398
chargesum: 0.00000
title: Mulliken charges with hydrogens summed into heavy atoms:
elementType: S N N C C C C C C C C C C C C C C
charge: 0.212568 -0.035180 0.045120 0.363084 0.073772 -0.368599 -0.077264 -0.054883 -0.126977 -0.005701 0.028087 0.030421 0.027046 -0.155972 0.018744 0.019960 0.005773
polarizability: 2.84059071e+02 -1.92255769e+01 1.59921614e+02 -3.88714730e-01 -5.69082463e-01 1.09839868e+02
1716.lowfreq: -0.0005 0.0011 0.0018 4.4139 8.0597 10.7030 16.7603 24.5030 53.3314
frequency: 15.8030 24.2437 53.3266 85.6182 154.0896 173.6200 202.7019 230.3976 272.1257 372.3518 399.0404 403.2736 415.0096 443.7686 463.1781 488.6865 515.3850 544.5014 567.7874 609.8958 653.6209 660.7287 679.3194 692.5343 754.9057 774.2492 790.3890 792.1595 799.0867 847.6680 882.4119 925.9691 935.3177 954.1558 969.3233 977.3306 985.0201 998.3066 1000.3773 1014.7015 1021.3907 1073.8480 1075.5259 1094.0412 1146.0591 1170.3748 1172.8258 1183.1276 1205.7344 1258.6315 1286.8577 1302.4447 1321.4593 1369.9016 1377.4747 1399.5938 1427.4971 1428.4998 1460.6642 1471.9532 1506.5958 1551.2049 1589.5937 1591.9424 1618.9949 3129.2057 3132.9563 3140.2420 3144.0085 3152.3036 3160.6222 3161.8511 3162.0490 3171.5384 3175.6050
redmass: 4.0193 6.4417 6.1179 4.8553 6.2624 5.8845 4.9811 5.6033 5.9693 8.3086 10.4323 2.8223 3.1539 5.1001 3.4782 5.6867 7.1386 6.8451 3.8933 6.4806 4.2993 6.9293 6.8674 2.1690 1.5265 1.3453 8.7626 3.7378 6.1224 1.2450 1.6053 1.3747 1.4425 7.9792 1.3715 1.3908 6.3141 1.3318 1.3305 3.4057 2.1962 1.5928 2.3542 3.2481 2.0633 1.1743 1.0536 1.1124 2.7948 2.1514 2.7583 1.3048 4.3399 1.8038 10.2062 3.5163 2.0948 2.2228 2.1330 3.0684 6.6135 6.8258 6.0917 6.4356 6.4562 1.0850 1.0859 1.0887 1.0904 1.0932 1.0956 1.0926 1.0969 1.1014 1.0991
irintensity: 0.0803 1.1421 1.4607 0.3957 0.2630 1.0425 1.3997 0.2141 0.2443 3.8931 1.2516 0.1266 5.7584 5.7757 2.7353 0.9130 5.5226 3.2632 2.4441 0.1966 4.6200 43.9145 4.7207 34.3790 79.4456 87.8919 33.4777 0.3275 7.0911 0.2759 0.5289 3.5183 11.1123 39.5021 2.7733 0.2076 10.4649 0.0567 0.1849 16.2448 6.0658 8.2758 3.0418 3.4272 14.0017 2.0610 0.0025 7.0052 19.2904 11.3965 9.2159 0.8479 252.1781 19.2361 1.9118 17.1181 10.3790 2.3649 28.2271 87.2342 49.4997 63.0113 5.9781 1.2463 9.7919 0.0941 0.8936 6.5946 10.7941 21.9839 24.3730 10.3188 20.5088 17.0641 18.7156
temp: 298.150 k
press: 1.00000 atm
elementType: 16 7 7 6 6 6 6 6 6 6 6 6 6 6 6 6 6 1 1 1 1 1 1 1 1 1 1
symmnumber: 1
zpe: 527307.9 jmol-1
zpe.correction: 0.200841 hartree
zpe.thermalcorrener: 0.214304 hartree
zpe.thermalcorrenthalpy: 0.215248 hartree
zpe.thermalcorrgfe: 0.157970 hartree
zpe.sumelectzpe: -1045.893150 hartree
zpe.sumelectthermal: -1045.879687 hartree
zpe.sumelectthermalent: -1045.878742 hartree
zpe.sumelectthermalfe: -1045.936021 hartree
dipole: -0.1933 -1.5761 0.0041
dipole: 1.5879
quadrupole: -83.0011 -107.9006 -102.0627
quadrupole: -10.7312 -0.1785 -0.3822
quadrupole: 14.6537 -10.2458 -4.4079 -10.7312 -0.1785 -0.3822
hfenergy: -1046.0939906 hartree
pointgroup: C01 [X(C14H10N2S1)]
dipole: 0.1024151 -0.5800724 -0.2081545 debye
polarizability: 281.474176|19.053363|154.2545256|18.7999725|18.284904|118.0918506 unknown
InChI: InChI=1S/C14H10N2S/c1-2-6-11(7-3-1)17-14-12-8-4-5-9-13(12)15-10-16-14/h1-10H
charge 0 multiplicity 1
27 atoms
S  0.775395 -1.576453 -0.291432
N  -2.19576 1.857895 0.701035
N  0.064866 0.948654 0.549092
C  -1.819676 -0.467318 -0.097712
C  -2.693092 0.640578 0.230186
C  -0.406158 -0.221399 0.098012
C  -2.383604 -1.688865 -0.577458
C  -4.104381 0.489339 0.068421
C  2.394943 -0.779194 0.09652
C  -3.769234 -1.810501 -0.727026
C  -4.632288 -0.716931 -0.402338
C  2.927162 -0.881328 1.400102
C  3.110194 -0.12949 -0.932386
C  -0.862954 1.939663 0.83079
C  4.19453 -0.31938 1.676819
C  4.377606 0.429736 -0.648874
C  4.919995 0.335354 0.65395
H  -1.72681 -2.529109 -0.828517
H  -4.739811 1.342524 0.324045
H  -4.199523 -2.747838 -1.095625
H  -5.714962 -0.829571 -0.525354
H  2.356484 -1.386868 2.185454
H  2.679813 -0.057038 -1.936159
H  -0.445495 2.882432 1.197273
H  4.610806 -0.392571 2.687444
H  4.935606 0.937818 -1.442899
H  5.902648 0.76896 0.870936
