program: Gaussian 09
title: 000242562
version: EM64L-G09RevD.01
frameworkgroup: C1[X(C17H18N2O4)]
method: RPBEPBE
basis: SDD
operation: Freq
keyword: #p
keyword: freq=noraman
keyword: PBEPBE/SDD
title: #p freq=noraman PBEPBE/SDD
converged: YES YES NO NO
title: Mulliken charges:
elementType: O O O O N N C C C C C C C C C C C C C C C C C H H H H H H H H H H H H H H H H H H
charge: -0.429197 -0.426235 -0.227065 -0.228129 -0.151645 0.011829 0.301265 -0.700538 0.199707 0.315552 0.197576 0.477735 -0.606219 -0.420232 -0.367224 -0.590114 -0.371642 -0.430881 -0.458016 0.404398 -0.391819 -0.327369 -0.316362 0.251363 0.250785 0.241250 0.238989 0.222897 0.295621 0.245757 0.222488 0.258698 0.224472 0.237729 0.283539 0.219279 0.215679 0.250045 0.198141 0.339858 0.338035
chargesum: 0.00000
title: Mulliken charges with hydrogens summed into heavy atoms:
elementType: O O O O N N C C C C C C C C C C C C C C C C C
charge: -0.089339 -0.088200 -0.227065 -0.228129 -0.151645 0.011829 0.301265 -0.198390 0.199707 0.315552 0.197576 0.477735 -0.364969 -0.181243 -0.144326 -0.294493 -0.125885 0.050306 0.004185 0.404398 -0.108280 0.107589 0.131824
polarizability: 5.40866532e+02 -1.35527143e+00 2.06367627e+02 -4.23459487e+00 -2.65368697e+01 1.15206847e+02
1716.lowfreq: -5.9349 -0.0004 0.0006 0.0007 1.3749 4.1248 21.3227 30.3267 47.0452
frequency: 20.8456 30.2559 47.0206 54.1875 65.5796 70.4910 95.3041 114.4221 118.3681 133.7445 170.4065 187.7858 208.8441 222.9582 239.0424 253.1626 293.0221 297.0568 322.2658 325.8816 347.7666 366.9508 398.3874 427.6294 441.6164 449.3926 484.8056 509.8774 516.0590 539.5980 556.6210 573.9353 587.4242 600.6495 661.9573 678.2323 705.1959 714.3063 734.1190 760.8989 763.0920 789.2486 801.6935 831.7149 845.2300 849.4094 866.2004 893.3784 911.0403 924.1533 942.5178 964.3287 972.3620 977.9066 987.5866 993.4903 1020.5194 1028.1636 1041.5445 1063.5478 1069.2753 1112.0571 1133.4708 1135.1734 1142.0933 1160.6940 1181.2575 1192.9858 1200.3283 1211.1504 1215.4851 1248.1641 1262.8587 1277.7079 1289.6803 1299.3619 1316.5215 1330.5820 1347.0164 1347.8508 1368.7795 1372.4692 1376.0808 1381.7321 1390.0765 1401.7200 1427.4090 1442.6891 1460.5484 1463.8440 1467.9911 1475.7735 1484.9705 1495.6021 1508.0115 1575.6032 1586.4991 1616.5004 1635.1805 2954.8758 2977.0139 2986.2678 2987.4493 3002.4603 3031.1589 3038.5566 3068.3508 3086.9422 3094.3493 3132.0862 3144.6069 3153.6921 3167.9023 3170.6510 3182.8267 3557.8334 3566.6249
redmass: 6.4948 6.2379 6.7171 7.3801 6.8628 6.6470 3.4243 2.5858 4.0939 3.1994 4.2559 5.7292 4.8261 4.7145 2.4896 3.6439 1.2526 2.0554 3.5806 1.6266 5.8570 4.8617 2.9219 2.8841 3.0302 3.9371 4.1158 3.5830 3.1341 4.1530 4.7213 3.4842 3.1412 4.9579 7.3832 4.7832 5.2269 3.5785 6.7323 6.5561 3.2763 1.2552 1.5420 2.9290 1.4905 1.5193 3.0066 4.5877 1.5788 2.1660 1.3809 4.2053 1.9184 3.2797 1.3595 3.9460 2.0278 2.9272 3.3200 1.5307 1.8773 2.1702 1.6275 1.1504 1.4355 1.4224 2.8082 1.7266 2.3771 2.0699 2.4623 1.6828 1.4011 1.2890 1.5291 1.1871 1.9627 1.2963 1.8723 2.7047 1.3605 2.5361 1.4391 1.2980 2.1165 4.0562 1.1941 3.7281 1.1593 1.6393 2.3920 1.2795 1.7815 1.6554 1.8628 7.2711 7.4247 7.5612 7.3223 1.0684 1.0669 1.0609 1.0610 1.0659 1.0994 1.1021 1.0936 1.1019 1.0955 1.0891 1.0903 1.0901 1.0936 1.0926 1.0948 1.0665 1.0665
irintensity: 0.7943 0.3837 2.1071 0.6394 3.2144 1.6264 5.3821 4.7269 4.3045 4.4869 0.5922 7.9395 3.2937 8.0157 10.5241 15.2269 186.6107 70.6600 26.8596 46.0918 3.8180 7.1396 36.7214 4.7857 2.1462 5.2481 5.9589 0.3970 3.2000 7.3023 4.9968 5.4357 1.9761 3.1488 1.3346 4.8480 4.3554 18.1285 13.9984 0.9425 3.1685 12.8089 40.0020 4.1053 37.2303 15.7540 17.2217 13.3851 1.7636 15.8426 0.4494 134.8454 27.3584 92.8603 0.4065 80.9868 13.7666 21.6401 27.0463 16.8936 44.7339 83.4207 31.0603 0.0449 29.8516 0.5625 58.5289 60.2706 565.7427 548.9928 193.3951 72.8404 82.5782 1.6832 11.8996 4.0330 67.8759 20.2029 19.1365 103.5978 109.1395 6.5910 37.7152 30.3613 112.0110 14.8579 9.1968 9.2236 7.0883 15.1596 127.2885 21.3010 63.6136 12.2175 89.0686 21.9581 31.7993 556.1854 302.9818 53.5166 42.8218 9.0086 88.2473 50.0258 5.5963 15.1413 7.6277 25.7768 37.3177 5.9178 8.6438 20.1471 33.4435 1.2632 1.5305 9.4637 17.4518
temp: 298.150 k
press: 1.00000 atm
elementType: 8 8 8 8 7 7 6 6 6 6 6 6 6 6 6 6 6 6 6 6 6 6 6 1 1 1 1 1 1 1 1 1 1 1 1 1 1 1 1 1 1
symmnumber: 1
zpe: 846370.1 jmol-1
zpe.correction: 0.322365 hartree
zpe.thermalcorrener: 0.343455 hartree
zpe.thermalcorrenthalpy: 0.344399 hartree
zpe.thermalcorrgfe: 0.270705 hartree
zpe.sumelectzpe: -1067.243176 hartree
zpe.sumelectthermal: -1067.222087 hartree
zpe.sumelectthermalent: -1067.221143 hartree
zpe.sumelectthermalfe: -1067.294837 hartree
dipole: 9.8857 0.5888 -1.0372
dipole: 9.9574
quadrupole: -193.7139 -118.4728 -139.9339
quadrupole: 13.2829 -4.4738 -11.9931
quadrupole: -43.0070 32.2341 10.7730 13.2829 -4.4738 -11.9931
hfenergy: -1067.5655418 hartree
pointgroup: C01 [X(C17H18N2O4)]
dipole: -3.8906467 -0.2126823 -0.4058286 debye
polarizability: 540.8711773|-2.2613643|205.1804991|3.4934151|28.4867475|116.3893303 unknown
InChI: InChI=1S/C17H18N2O4/c20-7-5-18(6-8-21)14-1-3-16-12(10-14)9-13-11-15(19(22)23)2-4-17(13)16/h1-4,10-11,20-21H,5-9H2
charge 0 multiplicity 1
41 atoms
O  -6.311523 2.579046 -0.353326
O  -5.399211 -2.322399 1.355123
O  6.90464 0.734058 0.273121
O  6.458119 -1.394403 -0.42547
N  -3.73721 -0.214244 -0.181107
N  6.079192 -0.213566 -0.044941
C  -0.025413 -0.674642 -0.278186
C  1.167904 -1.584148 -0.554556
C  0.433868 0.60989 0.149536
C  2.359356 -0.684826 -0.244554
C  1.89631 0.60936 0.170325
C  -2.36347 0.042577 -0.073544
C  -1.388812 -0.965915 -0.385908
C  -0.515264 1.609802 0.465662
C  -1.886581 1.331508 0.351151
C  3.7248 -0.970038 -0.319066
C  2.825815 1.62317 0.51341
C  -4.750804 0.74919 0.289695
C  -4.237183 -1.494307 -0.708903
C  4.635974 0.062368 0.028147
C  4.203501 1.347425 0.441162
C  -5.16393 1.77587 -0.795527
C  -4.362762 -2.612962 0.353309
H  1.158388 -2.487997 0.085398
H  1.184157 -1.939499 -1.603324
H  -1.698068 -1.968657 -0.693685
H  -0.195307 2.605852 0.791819
H  -2.599294 2.127324 0.582443
H  4.114868 -1.94295 -0.630064
H  2.48434 2.613456 0.832022
H  -4.386711 1.270654 1.195593
H  -5.648484 0.190461 0.603266
H  -3.580879 -1.843592 -1.528667
H  -5.231315 -1.317706 -1.164111
H  4.955862 2.098617 0.69512
H  -5.523219 1.251191 -1.69666
H  -4.304802 2.414266 -1.087913
H  -3.43062 -2.695956 0.934231
H  -4.555879 -3.583501 -0.153801
H  -6.030044 3.188656 0.374549
H  -6.293107 -2.431335 0.941431
