program: Gaussian 09
title: 000242561
version: EM64L-G09RevD.01
frameworkgroup: C1[X(C19H23NO2)]
method: RPBEPBE
basis: SDD
operation: Freq
keyword: #p
keyword: freq=noraman
keyword: PBEPBE/SDD
title: #p freq=noraman PBEPBE/SDD
converged: YES YES NO NO
title: Mulliken charges:
elementType: O O N C C C C C C C C C C C C C C C C C C C H H H H H H H H H H H H H H H H H H H H H H H
charge: -0.488765 -0.512684 -0.144822 0.317324 0.185113 -0.704536 0.429188 0.186581 0.270293 -0.398165 -0.518442 -0.611941 -0.432825 -0.372661 -0.048511 0.002387 -0.404868 -0.428095 -0.709516 -0.696593 -0.236671 -0.244313 0.241977 0.241163 0.215647 0.223754 0.217537 0.292415 0.257090 0.232709 0.218321 0.184396 0.241874 0.234464 0.237608 0.243458 0.212265 0.196766 0.214609 0.238176 0.219517 0.221192 0.221759 0.388995 0.366830
chargesum: 0.00000
title: Mulliken charges with hydrogens summed into heavy atoms:
elementType: O O N C C C C C C C C C C C C C C C C C C C
charge: -0.099770 -0.145854 -0.144822 0.317324 0.185113 -0.221396 0.429188 0.186581 0.270293 0.041237 -0.008490 -0.354851 -0.200116 -0.154340 0.135884 0.244261 -0.170404 -0.190486 -0.057027 -0.024291 -0.015479 -0.022554
polarizability: 3.80215740e+02 1.11520420e+00 2.16508579e+02 1.18533446e+01 -2.02054075e+01 1.33539770e+02
1716.lowfreq: -10.3283 -3.0082 0.0003 0.0007 0.0010 6.8861 27.2240 35.0449 41.0161
frequency: 26.4356 34.9524 40.9025 58.3118 78.3711 88.6724 135.2607 154.9943 169.1291 173.5951 196.1232 206.2112 231.0860 236.6192 238.8896 246.2699 268.2823 293.9000 318.5602 335.2227 360.8427 391.4603 424.3143 434.3255 436.2850 451.0786 473.2132 494.9308 499.3554 513.5432 543.7367 555.9421 595.2159 602.7290 644.6536 696.4131 705.9109 712.1620 737.2174 747.0448 770.7372 796.5585 803.3795 817.8410 834.4126 848.6046 866.9491 869.7865 901.0484 910.3844 926.2881 930.1358 937.3672 944.9717 964.1284 979.3909 981.8694 1003.8999 1024.9896 1054.5466 1067.0709 1088.5113 1094.1372 1104.4940 1114.4883 1126.5290 1130.4774 1143.8536 1165.8234 1167.6694 1181.0138 1189.0235 1202.8186 1217.9250 1235.5383 1249.2732 1272.9149 1302.0684 1304.9048 1309.0000 1322.9248 1337.8306 1341.8734 1351.1734 1364.1489 1375.9508 1382.7767 1390.1594 1390.8709 1393.9763 1428.2416 1435.9222 1445.8778 1459.0801 1462.2831 1463.8429 1467.8564 1470.6841 1473.8833 1480.4066 1493.6536 1497.9233 1578.6518 1589.9567 1619.3179 1632.5128 2916.1387 2931.1642 2978.0769 2980.0593 2981.9333 2993.1268 3002.9946 3008.0233 3023.8544 3070.5678 3078.9860 3080.6540 3089.1039 3099.9857 3116.7387 3122.7941 3124.6944 3138.1951 3157.9399 3158.6963 3162.3150 3250.9443 3600.6516
redmass: 4.8969 4.6655 3.6096 3.8478 4.6538 4.0206 3.5256 4.0083 3.2516 3.7599 3.4916 1.2508 1.3950 2.1066 1.8237 1.3453 3.2251 3.3599 3.3241 4.0693 3.8854 3.5285 2.7260 2.8356 3.3160 3.2555 2.4984 3.1104 2.5124 3.4564 4.7317 4.2009 3.4552 3.6141 5.7569 1.4668 2.7638 2.5465 1.6429 5.1095 1.9915 2.9874 1.6687 4.3616 2.2465 1.8040 1.4185 3.0965 1.7047 1.9672 1.6178 1.7535 1.4016 1.7439 1.9083 1.3310 3.0946 3.0545 2.1202 1.8937 2.3656 2.3970 2.1666 2.0445 2.1461 2.0715 1.1542 2.0334 1.2586 1.2402 2.1206 2.1355 1.7805 1.6743 1.1513 1.7258 1.4649 1.4110 1.3036 1.8646 1.3796 1.3091 1.3372 1.9037 2.2146 1.3974 1.7384 2.0792 1.2719 1.8115 1.1540 1.2505 2.3652 1.1762 3.9633 2.1809 1.0935 1.0839 1.1380 1.0764 1.7652 1.5406 7.0465 6.5092 7.2512 7.2510 1.0748 1.0733 1.0366 1.0607 1.0365 1.0857 1.0933 1.0685 1.0994 1.0986 1.1002 1.0974 1.0988 1.0989 1.0852 1.0890 1.0889 1.0943 1.0997 1.0923 1.0913 1.0706 1.0666
irintensity: 1.8318 1.6750 1.9900 6.2587 1.5490 1.5853 0.5361 1.5203 3.7594 4.9787 2.5690 1.5330 1.6939 7.7753 25.1530 118.5167 15.9097 6.9954 0.3592 0.5680 12.9537 9.9710 10.3790 1.1100 10.3789 1.0195 5.6050 5.0814 5.9370 0.5723 0.2850 1.6479 2.0598 14.6475 3.3055 46.2393 3.6914 17.2634 50.9317 2.2105 67.2841 18.6675 20.5318 3.7052 1.6183 12.0239 1.9510 25.8439 15.6118 13.2217 1.2173 9.5466 0.5674 9.3393 13.3105 0.2407 8.4912 15.8298 23.5529 6.9600 63.0598 112.9380 13.5473 22.9217 3.4405 54.9247 0.6109 12.7305 7.2951 12.1185 20.9066 1.3443 11.9365 20.9317 17.6738 19.0169 57.3452 3.4789 8.2402 14.4909 14.8164 25.1669 8.2051 37.7529 108.6636 34.4836 9.4518 4.7248 34.4588 7.6867 15.6950 117.3173 16.0645 20.9457 168.1522 4.6962 17.0736 16.7177 21.9782 27.6881 12.3165 80.1823 23.7059 1.8019 46.5097 248.6227 17.7008 90.2824 25.4429 15.3902 29.7212 26.2618 35.9712 47.7168 9.1235 28.2485 50.3412 1.8496 31.9761 28.7860 7.4365 14.0924 1.4862 35.0721 53.1742 26.3076 15.5756 472.3020 12.6523
temp: 298.150 k
press: 1.00000 atm
elementType: 8 8 7 6 6 6 6 6 6 6 6 6 6 6 6 6 6 6 6 6 6 6 1 1 1 1 1 1 1 1 1 1 1 1 1 1 1 1 1 1 1 1 1 1 1
symmnumber: 1
zpe: 987555.6 jmol-1
zpe.correction: 0.376140 hartree
zpe.thermalcorrener: 0.396919 hartree
zpe.thermalcorrenthalpy: 0.397863 hartree
zpe.thermalcorrgfe: 0.326394 hartree
zpe.sumelectzpe: -941.400341 hartree
zpe.sumelectthermal: -941.379562 hartree
zpe.sumelectthermalent: -941.378618 hartree
zpe.sumelectthermalfe: -941.450086 hartree
dipole: -0.6442 2.3217 1.0082
dipole: 2.6119
quadrupole: -145.2974 -114.1917 -129.7376
quadrupole: -13.9178 -0.1271 -0.1397
quadrupole: -15.5551 15.5505 0.0046 -13.9178 -0.1271 -0.1397
hfenergy: -941.7764807 hartree
pointgroup: C01 [X(C19H23N1O2)]
dipole: 0.307471 -0.9623582 0.1877823 debye
polarizability: 379.3378088|13.4580012|204.8424384|-12.4467145|35.3743439|146.0838423 unknown
InChI: InChI=1S/C19H23NO2/c1-13(21)11-20(12-14(2)22)17-7-8-19-16(10-17)9-15-5-3-4-6-18(15)19/h3-8,10,13-14,21-22H,9,11-12H2,1-2H3
charge 0 multiplicity 1
45 atoms
O  5.19121 1.120012 0.643534
O  3.975263 -1.181472 1.37659
N  2.244786 0.310888 -0.445087
C  -1.417625 0.628214 0.299402
C  -1.953394 -0.51795 -0.358903
C  -2.545617 1.419928 0.956547
C  0.8635 0.028334 -0.388747
C  -3.413948 -0.53599 -0.175299
C  -3.787216 0.605391 0.602703
C  2.741482 1.536822 0.229987
C  3.185191 -0.742442 -0.854574
C  -0.044023 0.903917 0.297318
C  -1.071394 -1.396788 -1.02453
C  0.311225 -1.130601 -1.033831
C  4.203478 1.929313 -0.078741
C  3.375514 -1.862428 0.197164
C  -4.399608 -1.444462 -0.624277
C  -5.132808 0.839055 0.930794
C  4.455276 3.397761 0.30368
C  4.28803 -2.989759 -0.308368
C  -5.754002 -1.204506 -0.291937
C  -6.12145 -0.073629 0.478907
H  -2.605751 2.454246 0.563975
H  -2.406773 1.505551 2.052474
H  2.102398 2.378892 -0.100312
H  2.633157 1.449994 1.33496
H  2.850358 -1.205732 -1.800746
H  4.170824 -0.295086 -1.060563
H  0.32511 1.781546 0.8339
H  -1.447612 -2.289242 -1.538253
H  0.963987 -1.827106 -1.567282
H  4.376565 1.819337 -1.173833
H  2.384834 -2.260949 0.494318
H  -4.125526 -2.321836 -1.221477
H  -5.422242 1.712695 1.527022
H  5.532521 3.613043 0.205609
H  4.167686 3.583103 1.354875
H  3.893222 4.088583 -0.352143
H  4.437706 -3.765252 0.46608
H  5.277751 -2.590726 -0.594215
H  3.842613 -3.486293 -1.190347
H  -6.529024 -1.900084 -0.634205
H  -7.175395 0.096099 0.726548
H  4.775591 0.283394 1.018569
H  4.117323 -1.817382 2.118312
