program: Gaussian 09
title: 000242554
version: EM64L-G09RevD.01
frameworkgroup: C1[X(C14H10BrNO)]
method: RPBEPBE
basis: SDD
operation: Freq
keyword: #p
keyword: freq=noraman
keyword: PBEPBE/SDD
title: #p freq=noraman PBEPBE/SDD
converged: YES YES NO NO
title: Mulliken charges:
elementType: Br O N C C C C C C C C C C C C C C H H H H H H H H H H
charge: -0.022807 -0.245157 -0.411742 -0.819465 0.382596 0.198113 0.343548 0.202402 -0.524848 -0.386595 -0.383350 -0.395765 0.501898 -0.457727 -0.237904 -0.224416 -0.070439 0.324543 0.327243 0.244330 0.254901 0.240649 0.221461 0.231102 0.228980 0.305406 0.173044
chargesum: 0.00000
title: Mulliken charges with hydrogens summed into heavy atoms:
elementType: Br O N C C C C C C C C C C C C C C
charge: -0.022807 -0.245157 -0.106336 -0.494922 0.382596 0.198113 0.343548 0.202402 -0.197605 -0.142264 -0.128449 -0.155116 0.501898 -0.236267 -0.006802 0.004564 0.102605
polarizability: 2.95825145e+02 -1.06612289e+01 1.97874612e+02 5.81158170e+00 1.62462118e+01 8.73322534e+01
1716.lowfreq: -5.1464 -2.1172 -0.0007 -0.0004 -0.0003 4.9956 35.2549 70.5925 74.4028
frequency: 35.2450 70.5910 74.4016 86.3601 129.5551 141.6827 184.3641 191.4784 241.9537 299.6888 336.7038 372.3331 380.5451 416.1593 446.3862 489.0951 517.8743 540.7635 569.2106 591.3805 645.4658 648.0921 660.8274 694.7830 746.7924 754.6347 766.4244 786.6186 815.4119 830.3790 842.8297 883.6434 930.3027 942.0577 947.9390 953.4089 955.5317 989.3087 994.2426 1025.8510 1089.4087 1099.0428 1121.9011 1130.3345 1156.8763 1171.2453 1182.8656 1201.3902 1225.8640 1269.8784 1289.3714 1307.0353 1359.5810 1383.3840 1389.9312 1442.8327 1453.0480 1461.6559 1491.2307 1507.5997 1593.1017 1598.6354 1618.4864 1626.8837 1637.7343 2932.6630 3084.5509 3116.3557 3127.2484 3136.9500 3148.0382 3149.8619 3165.8861 3183.3240 3515.1275
redmass: 8.9779 7.3650 6.6309 6.5614 5.7024 4.1534 5.2220 4.9417 7.9026 3.8438 7.0493 5.5891 3.7072 3.5110 3.0823 4.3437 4.6531 6.3205 5.3565 3.5607 5.0045 1.2848 3.5274 5.8031 2.1337 3.7976 3.2399 2.3208 5.1775 1.6343 4.6019 1.5016 2.2245 1.8782 1.4120 1.4182 1.6079 1.3654 6.1362 2.1112 2.3563 2.0380 1.1617 1.8870 1.3950 1.1796 1.7291 2.0939 1.7595 1.8403 1.5894 2.1195 2.7491 2.2989 2.2317 2.7847 2.6728 4.0451 3.8302 2.2145 6.8681 6.1910 7.0971 6.8393 5.0291 1.0864 1.0874 1.0886 1.0859 1.0894 1.0952 1.0957 1.1003 1.0940 1.0769
irintensity: 1.4164 0.1477 8.3298 7.4847 6.0097 1.6630 5.9296 2.8285 4.1980 9.2733 4.1573 3.1181 13.7724 3.9456 1.1854 18.9703 0.9109 0.7919 2.8586 19.7513 11.6387 57.0656 27.4082 7.0658 74.8053 21.3759 5.0576 25.3532 11.8853 42.1000 11.0741 0.1927 4.4562 0.6391 1.1489 2.2564 16.1520 0.0988 1.7849 3.0279 11.3553 14.5030 27.1515 8.6334 3.7193 6.7326 16.0429 4.0478 12.1051 11.9379 8.8814 9.8542 15.3712 4.2544 66.5019 13.8478 43.8834 143.8799 190.3694 91.3115 7.4965 53.1471 19.8675 33.0085 201.2706 148.2910 2.2654 22.0789 2.2301 1.6612 8.0513 29.7820 34.1159 6.1392 14.9118
temp: 298.150 k
press: 1.00000 atm
elementType: 35 8 7 6 6 6 6 6 6 6 6 6 6 6 6 6 6 1 1 1 1 1 1 1 1 1 1
symmnumber: 1
zpe: 528149.1 jmol-1
zpe.correction: 0.201161 hartree
zpe.thermalcorrener: 0.214966 hartree
zpe.thermalcorrenthalpy: 0.215910 hartree
zpe.thermalcorrgfe: 0.158866 hartree
zpe.sumelectzpe: -681.789065 hartree
zpe.sumelectthermal: -681.775261 hartree
zpe.sumelectthermalent: -681.774317 hartree
zpe.sumelectthermalfe: -681.831360 hartree
dipole: -0.2534 -5.6515 -0.3584
dipole: 5.6685
quadrupole: -86.5038 -101.8306 -110.7794
quadrupole: 15.2256 8.4694 5.4182
quadrupole: 13.2008 -2.1260 -11.0748 15.2256 8.4694 5.4182
hfenergy: -681.9902268 hartree
pointgroup: C01 [X(C14H10Br1N1O1)]
dipole: -0.0592714 -2.213795 -0.2630106 debye
polarizability: 296.9209664|2.8381347|199.1925292|3.0672046|3.9209977|84.9185141 unknown
InChI: InChI=1S/C14H10BrNO/c15-14-12-4-2-1-3-10(12)11-6-5-9(16-8-17)7-13(11)14/h1-8,14,16H
charge 0 multiplicity 1
27 atoms
Br -0.492556 2.926855 1.162908
O  4.492976 1.498757 -0.422395
N  3.9167 -0.75017 0.033378
C  -0.672805 1.481562 -0.316517
C  0.347338 0.377391 -0.126696
C  -0.332384 -0.862274 0.071904
C  -2.006237 0.771145 -0.22646
C  -1.78805 -0.621634 0.008992
C  1.745422 0.46683 -0.151631
C  0.414256 -2.043117 0.259872
C  -3.305479 1.287763 -0.355166
C  -2.882496 -1.504207 0.115711
C  2.491761 -0.731529 0.037896
C  1.822473 -1.971188 0.244411
C  -4.404846 0.399086 -0.247557
C  -4.192734 -0.982223 -0.0130
C  4.802094 0.301384 -0.181872
H  -0.528249 2.0944 -1.219439
H  2.266589 1.415935 -0.291863
H  -0.079891 -3.008423 0.411872
H  -3.468478 2.359142 -0.514802
H  -2.730117 -2.574964 0.29115
H  2.412366 -2.885125 0.391544
H  -5.426471 0.782577 -0.341926
H  -5.054565 -1.653774 0.069984
H  4.348859 -1.661501 0.209326
H  5.859229 -0.045094 -0.117025
