program: Gaussian 09
title: 000242552
version: EM64L-G09RevD.01
frameworkgroup: C1[X(C21H26NO4P)]
method: RPBEPBE
basis: SDD
operation: Freq
keyword: #p
keyword: freq=noraman
keyword: PBEPBE/SDD
title: #p freq=noraman PBEPBE/SDD
converged: NO YES NO NO
title: Mulliken charges:
elementType: P O O O O N C C C C C C C C C C C C C C C C C C C C C H H H H H H H H H H H H H H H H H H H H H H H H H H
charge: 1.256460 -0.543026 -0.525777 -0.632039 -0.256865 -0.447936 -0.839404 0.356860 0.304962 0.186385 0.168074 -0.652961 -0.410459 -0.395195 -0.401975 0.533489 0.055392 0.024324 -0.380868 -0.245846 -0.229920 -0.665801 -0.666124 -0.667958 -0.658923 0.207025 -0.801653 0.332109 0.268937 0.288751 0.242635 0.243483 0.223419 0.242020 0.309730 0.230509 0.226799 0.206256 0.239057 0.214376 0.206049 0.258369 0.207266 0.221565 0.207769 0.226946 0.203194 0.223175 0.251218 0.313598 0.236666 0.269255 0.236611
chargesum: 0.00000
title: Mulliken charges with hydrogens summed into heavy atoms:
elementType: P O O O O N C C C C C C C C C C C C C C C C C C C C C
charge: 1.256460 -0.543026 -0.525777 -0.632039 -0.256865 -0.134337 -0.507294 0.356860 0.304962 0.186385 0.168074 -0.384024 -0.121709 -0.152560 -0.158492 0.533489 0.278811 0.266344 -0.071138 -0.015338 -0.003121 -0.006112 0.005560 -0.011677 0.018664 0.207025 -0.059122
polarizability: 3.80566117e+02 -3.93048617e+01 2.99452617e+02 -2.16679818e+01 -2.11296892e+01 1.91109033e+02
1716.lowfreq: -77.4337 -7.0006 0.0003 0.0005 0.0008 0.8462 7.7331 13.1887 23.5916
frequency: -77.4336 12.5446 23.5474 25.6464 33.2678 39.4398 50.5745 55.2736 59.6482 71.5148 99.3894 105.9530 115.5137 137.2108 148.5731 152.4439 179.0291 179.5328 192.8569 194.0461 217.1169 229.0184 229.4835 238.4476 247.8721 272.5991 324.8877 339.1229 340.7570 350.9493 358.3011 388.9108 401.2211 415.9783 418.3815 442.3679 447.0169 460.3465 481.0919 517.0615 522.6350 546.6349 574.4623 582.1432 601.8882 625.5381 636.7570 651.7972 665.1355 680.8359 706.6761 734.6185 751.7680 774.9321 793.4939 800.4234 824.4335 835.2200 856.1321 863.9149 885.8284 895.4552 904.6839 908.2666 913.9513 924.6382 925.8123 935.4754 935.7770 954.8467 957.2988 987.9698 989.0399 991.2331 1002.9375 1017.1862 1028.5230 1030.0238 1092.1176 1097.0754 1102.4200 1122.4665 1135.2568 1152.4384 1154.2375 1164.8979 1171.1932 1177.7885 1180.3036 1182.6143 1193.9836 1222.9629 1236.3495 1271.0675 1299.4374 1306.9965 1323.8744 1325.8614 1343.0893 1343.3382 1368.4337 1375.6171 1377.3971 1379.8799 1387.6394 1392.2592 1394.2941 1432.9743 1443.7457 1453.5024 1453.9740 1454.1459 1461.0246 1463.2923 1465.5174 1466.6444 1468.5882 1469.4086 1482.8880 1484.2815 1486.0765 1520.9831 1589.9863 1596.0719 1617.1221 1628.1452 1635.7182 2983.8832 2985.2056 2986.8025 2989.0304 2989.7517 2991.7571 3005.5759 3012.0109 3071.5166 3078.2554 3081.0080 3088.4517 3088.5481 3094.0533 3100.1215 3100.5513 3104.4116 3126.4746 3127.3867 3136.6417 3137.9542 3139.7225 3150.3828 3164.9644 3194.9390 3521.2307
redmass: 1.0476 3.7744 2.6960 3.0203 4.1277 3.9846 5.2207 4.1246 4.1317 5.2086 4.8881 4.3647 5.5978 4.3579 5.1216 4.4746 1.1407 3.0306 1.0557 5.6594 2.9706 1.3956 1.1634 4.6393 4.1155 5.3504 3.2800 3.0177 4.1207 3.7757 3.4449 3.5074 3.6153 3.9806 2.7677 3.9961 3.6938 3.4340 4.0068 4.9618 5.4356 4.7843 3.4177 4.4322 3.3924 3.7573 4.5903 1.5769 3.4624 4.8341 4.6695 5.2251 1.5818 3.8236 3.3186 3.0154 5.4920 4.5008 3.7967 1.4885 1.5769 3.2393 2.6924 1.9639 3.0742 1.2934 1.2281 1.2746 1.3727 1.4536 3.0440 2.1891 1.5134 1.3717 2.5777 11.5018 2.1701 1.6581 1.6431 2.0889 1.7066 1.8705 1.2337 2.0943 2.1516 1.5398 1.1461 1.9605 1.9234 1.3006 2.3783 2.8336 1.6446 2.2669 1.6850 2.0085 1.2644 1.2382 1.3032 1.3862 5.3163 1.2796 1.2551 1.2665 4.8407 1.2296 1.2192 2.3330 2.6075 1.3089 1.0517 1.0537 2.4657 1.0947 1.0505 1.0507 1.0470 1.0557 1.8479 1.3768 1.0575 2.4635 6.9523 6.1120 7.1238 5.9652 5.9125 1.0358 1.0355 1.0384 1.0357 1.0359 1.0863 1.0868 1.0828 1.0983 1.0994 1.0988 1.0987 1.0988 1.1010 1.1003 1.1003 1.1004 1.0857 1.0923 1.0978 1.0905 1.0905 1.0951 1.1003 1.0945 1.0764
irintensity: 0.0175 0.0821 0.0089 0.2774 0.7958 1.8471 1.1185 4.0871 5.3850 2.3397 4.3070 1.1792 2.0901 1.3322 0.4503 4.0555 0.1510 4.2750 0.1983 8.0599 6.7719 1.1370 1.5604 1.0005 2.1615 3.4545 1.9436 2.9545 0.9411 3.6583 1.9005 18.8426 5.8125 10.3590 3.7319 6.9684 4.6943 39.9088 24.3967 5.1544 37.8845 7.5642 2.6397 0.9227 11.9357 11.6781 5.0856 62.0464 66.6572 3.1857 4.9357 4.2165 64.3772 14.0655 4.2480 10.4025 233.2856 166.7841 16.4324 25.6612 3.9207 16.5371 113.2969 16.6631 112.2030 6.4019 4.3746 0.7454 2.5336 6.1218 30.4269 14.8606 2.8752 3.0651 2.3135 77.6312 3.8907 7.7270 68.7066 11.4470 101.7340 1.6280 1.5098 12.1953 13.0776 6.0475 0.2608 14.9601 12.7193 1.8563 1.6437 40.6145 47.7862 11.2786 60.3601 5.8720 6.9966 13.2029 10.4350 2.5523 216.4393 85.3808 18.0944 26.4747 19.1957 33.5509 18.3683 45.8622 31.5264 27.2695 5.5583 4.6310 124.2957 19.9160 2.1319 6.5943 19.2813 10.3513 18.7119 6.5253 9.2100 421.9944 4.2796 10.6478 8.3373 152.9049 69.1515 16.4765 13.2208 9.0112 23.7196 27.6113 9.1277 7.7054 0.3701 15.2921 6.8627 6.3819 46.2357 68.7197 17.2759 21.4736 21.6220 27.7540 3.5719 7.8508 8.1706 4.2242 13.2784 17.0785 30.8153 5.2716 10.8848
temp: 298.150 k
press: 1.00000 atm
elementType: 15 8 8 8 8 7 6 6 6 6 6 6 6 6 6 6 6 6 6 6 6 6 6 6 6 6 6 1 1 1 1 1 1 1 1 1 1 1 1 1 1 1 1 1 1 1 1 1 1 1 1 1 1
symmnumber: 1
zpe: 1118600.1 jmol-1
zpe.correction: 0.426052 hartree
zpe.thermalcorrener: 0.454050 hartree
zpe.thermalcorrenthalpy: 0.454994 hartree
zpe.thermalcorrgfe: 0.364608 hartree
zpe.sumelectzpe: -1510.757879 hartree
zpe.sumelectthermal: -1510.729882 hartree
zpe.sumelectthermalent: -1510.728938 hartree
zpe.sumelectthermalfe: -1510.819324 hartree
dipole: -0.2487 3.1947 0.2543
dipole: 3.2144
quadrupole: -171.2066 -153.3219 -166.6541
quadrupole: -25.7471 13.2559 -0.1246
quadrupole: -7.4790 10.4056 -2.9266 -25.7471 13.2559 -0.1246
hfenergy: -1511.1839315 hartree
pointgroup: C01 [X(C21H26N1O4P1)]
dipole: 0.1140547 -1.2335154 -0.2544887 debye
polarizability: 382.9031299|-39.4059412|278.2218554|1.4588395|48.5463058|210.0027815 unknown
InChI: InChI=1S/C21H26NO4P/c1-13(2)25-27(24,26-14(3)4)21-19-9-7-6-8-17(19)18-11-10-16(12-20(18)21)22-15(5)23/h6-14,21-22H,1-5H3
charge 0 multiplicity 1
53 atoms
P  -1.526459 -1.310826 -0.774549
O  -0.306349 -2.182345 -1.64681
O  -1.182961 -1.72196 0.87971
O  -3.035172 -1.621206 -1.202579
O  5.598525 1.291034 0.954951
N  4.072775 0.016437 -0.299081
C  -0.909563 0.449181 -1.10381
C  0.450744 0.786625 -0.510807
C  -1.832876 1.50109 -0.498324
C  0.331622 1.934005 0.331025
C  -1.074757 2.371337 0.343017
C  1.685963 0.161612 -0.711522
C  -3.215418 1.679439 -0.677395
C  1.47913 2.452754 0.966475
C  -1.710204 3.44464 1.005034
C  2.83955 0.69028 -0.065163
C  -0.446145 -3.674368 -1.800126
C  -2.326468 -1.933442 1.842376
C  2.733865 1.836972 0.772842
C  -3.84838 2.758051 -0.008443
C  -3.101109 3.630525 0.822278
C  -0.069986 -3.980393 -3.253259
C  0.458652 -4.358238 -0.765745
C  -1.893855 -3.101175 2.735262
C  -2.571819 -0.629684 2.612822
C  5.348872 0.315445 0.188469
C  6.430229 -0.653081 -0.295071
H  -0.902971 0.48802 -2.210474
H  1.749625 -0.733258 -1.342129
H  -3.79052 0.990437 -1.304515
H  1.411224 3.335659 1.611588
H  -1.141565 4.123967 1.649687
H  -1.508944 -3.936092 -1.622423
H  -3.219177 -2.203755 1.244594
H  3.633514 2.222655 1.25494
H  -4.925231 2.916331 -0.132448
H  -3.608651 4.458529 1.329996
H  -0.114242 -5.069834 -3.436892
H  -0.760104 -3.476313 -3.950269
H  0.95757 -3.633353 -3.462768
H  0.344696 -5.45693 -0.825474
H  0.201273 -4.025834 0.253909
H  1.517866 -4.10848 -0.957081
H  -1.732961 -4.015832 2.138774
H  -2.674881 -3.308409 3.489941
H  -0.955303 -2.854097 3.261897
H  -3.376983 -0.775695 3.357054
H  -1.654587 -0.318555 3.143199
H  -2.876706 0.18442 1.932947
H  4.007979 -0.801777 -0.909896
H  6.217124 -1.688705 0.029431
H  7.394242 -0.34135 0.131286
H  6.511811 -0.647859 -1.39805
