program: Gaussian 09
title: 000242551
version: EM64L-G09RevD.01
frameworkgroup: C1[X(C13H11O3P)]
method: RPBEPBE
basis: SDD
operation: Freq
keyword: #p
keyword: freq=noraman
keyword: PBEPBE/SDD
title: #p freq=noraman PBEPBE/SDD
converged: NO YES NO NO
title: Mulliken charges:
elementType: P O O O C C C C C C C C C C C C C H H H H H H H H H H H
charge: 1.230763 -0.670287 -0.670311 -0.605544 -0.832592 0.309850 0.309678 0.170343 0.170366 -0.396837 -0.396751 -0.391911 -0.391899 -0.235085 -0.235127 -0.228436 -0.228416 0.346032 0.283036 0.283096 0.242617 0.242612 0.228834 0.228840 0.228438 0.228429 0.390134 0.390130
chargesum: 0.00000
title: Mulliken charges with hydrogens summed into heavy atoms:
elementType: P O O O C C C C C C C C C C C C C
charge: 1.230763 -0.280154 -0.280181 -0.605544 -0.486560 0.309850 0.309678 0.170343 0.170366 -0.113801 -0.113655 -0.149294 -0.149287 -0.006251 -0.006287 0.000002 0.000013
polarizability: 2.36399571e+02 -2.08492154e-01 1.84473667e+02 -6.83414972e-02 -1.71736459e+01 9.42998968e+01
1716.lowfreq: -9.7338 -0.0020 -0.0015 -0.0009 5.6627 9.3463 24.2382 60.3663 92.1241
frequency: 23.8834 60.3639 92.1188 99.2431 105.4750 152.3481 176.0787 196.0165 243.9765 244.5751 280.8721 291.3255 339.0309 347.6561 377.5680 409.6117 428.9432 444.0340 473.2345 506.8285 565.5254 582.8240 618.0249 634.4384 651.8228 694.1726 709.2414 741.6039 748.8557 751.8101 781.9495 796.4990 831.2362 870.7875 885.6239 889.9622 958.6360 959.3353 981.5437 991.3333 992.0644 993.0756 995.8011 1021.6717 1031.1795 1079.1851 1094.0512 1107.3561 1123.0279 1170.3862 1170.5271 1182.3115 1194.7239 1194.9863 1245.3070 1293.7521 1305.5816 1377.9682 1403.6286 1439.5326 1445.0939 1466.8866 1483.9895 1591.9350 1592.1381 1617.7760 1621.2765 3017.9387 3127.4809 3128.4798 3139.7004 3141.1875 3153.8451 3154.6112 3167.2538 3167.8694 3582.2224 3585.2043
redmass: 5.2999 5.5579 3.3707 4.9172 3.3260 3.5479 8.6958 5.5997 6.0822 2.3927 4.0822 3.6518 5.8590 1.2057 5.7070 5.5541 3.4327 3.0369 4.8088 4.9231 3.5809 5.1011 6.8670 8.1175 5.0896 5.8793 8.3370 5.3159 1.7760 1.8932 2.0133 2.1101 3.6456 4.6301 1.3723 1.5837 1.3850 1.4105 2.1102 1.3602 1.1921 1.3214 5.2006 2.2238 2.0038 2.2137 2.1615 1.6758 1.2738 1.1493 1.1523 1.3593 2.2389 2.0825 1.9394 1.4933 1.9366 8.9903 3.6409 2.2366 2.8442 2.6520 3.9493 6.5058 7.1310 7.4768 7.1125 1.0837 1.0857 1.0856 1.0903 1.0904 1.0949 1.0951 1.0998 1.0999 1.0658 1.0662
irintensity: 1.9770 0.7184 1.5643 2.6769 6.6948 0.0620 3.7694 6.0269 22.9523 15.8642 31.4116 9.2538 44.2708 187.1411 44.8995 2.5785 15.1487 0.0117 21.0552 0.6337 0.0340 1.1119 4.5458 68.7631 53.7880 82.6995 212.1418 7.5666 12.0294 119.1508 45.6601 0.2249 0.1778 11.1933 1.3464 0.1236 3.6001 0.0243 0.8770 0.0067 34.5541 0.0376 0.9285 3.4020 11.3167 137.0890 5.2971 0.0068 4.1938 0.2743 0.0118 11.2483 2.8173 1.3609 2.1066 0.7016 1.2570 2.5530 1.4964 27.3935 20.1500 9.5389 1.6564 2.5896 0.0031 3.3898 0.5788 0.5385 3.2120 0.2462 12.0377 6.8919 5.3095 32.1264 45.8539 3.9165 56.6497 54.6181
temp: 298.150 k
press: 1.00000 atm
elementType: 15 8 8 8 6 6 6 6 6 6 6 6 6 6 6 6 6 1 1 1 1 1 1 1 1 1 1 1
symmnumber: 1
zpe: 541546.0 jmol-1
zpe.correction: 0.206264 hartree
zpe.thermalcorrener: 0.221378 hartree
zpe.thermalcorrenthalpy: 0.222322 hartree
zpe.thermalcorrgfe: 0.163499 hartree
zpe.sumelectzpe: -1067.708288 hartree
zpe.sumelectthermal: -1067.693175 hartree
zpe.sumelectthermalent: -1067.692230 hartree
zpe.sumelectthermalfe: -1067.751053 hartree
dipole: -0.0006 -0.0941 -0.9449
dipole: 0.9495
quadrupole: -89.3884 -87.0817 -118.4793
quadrupole: 0.0107 -0.0099 -2.9277
quadrupole: 8.9281 11.2347 -20.1628 0.0107 -0.0099 -2.9277
hfenergy: -1067.9145521 hartree
pointgroup: C01 [X(C13H11O3P1)]
dipole: 0.0005478 -0.03419 0.3720092 debye
polarizability: 236.3981424|-0.3036885|184.7329898|-0.159773|16.4807915|94.0420025 unknown
InChI: InChI=1S/C13H11O3P/c14-17(15,16)13-11-7-3-1-5-9(11)10-6-2-4-8-12(10)13/h1-8,13-15H
charge 0 multiplicity 1
28 atoms
P  0.01804 2.473274 -0.349271
O  1.400101 3.275883 0.346203
O  -1.35136 3.293108 0.351173
O  0.015235 2.47472 -1.94277
C  0.009859 0.902667 0.691524
C  1.201845 -0.002886 0.400248
C  -1.194844 0.012642 0.404774
C  0.731882 -1.278948 -0.034304
C  -0.743119 -1.269405 -0.031491
C  2.576689 0.261641 0.520168
C  -2.565655 0.295143 0.529692
C  1.649635 -2.302603 -0.352568
C  -1.675332 -2.28102 -0.346213
C  3.494456 -0.769774 0.200276
C  -3.497978 -0.724233 0.213338
C  3.033862 -2.03783 -0.233688
C  -3.055532 -1.998219 -0.222152
H  0.014374 1.296603 1.725747
H  2.925497 1.2446 0.851378
H  -2.900308 1.282698 0.86183
H  1.301384 -3.286902 -0.684227
H  -1.341198 -3.269799 -0.679054
H  4.570708 -0.585313 0.288133
H  -4.571403 -0.525776 0.305141
H  3.759768 -2.821284 -0.478239
H  -3.792468 -2.772206 -0.463858
H  1.831325 3.921217 -0.271002
H  -1.77636 3.944205 -0.264291
