program: Gaussian 09
title: 000242543
version: EM64L-G09RevD.01
frameworkgroup: C1[X(C11H9N3O3)]
method: RPBEPBE
basis: SDD
operation: Freq
keyword: #p
keyword: freq=noraman
keyword: PBEPBE/SDD
title: #p freq=noraman PBEPBE/SDD
converged: YES YES NO NO
title: Mulliken charges:
elementType: O O O N N N C C C C C C C C C C C H H H H H H H H H
charge: -0.187897 -0.260301 -0.225530 0.089253 -0.381647 -0.383465 0.142242 -0.154828 0.468760 -0.473678 0.157292 0.212403 -0.357333 -0.345756 -0.195377 0.167832 -0.806758 0.327092 0.283573 0.239829 0.371193 0.367863 0.238478 0.240573 0.235057 0.231130
chargesum: 0.00000
title: Mulliken charges with hydrogens summed into heavy atoms:
elementType: O O O N N N C C C C C C C C C C C
charge: -0.187897 -0.260301 -0.225530 0.089253 -0.010454 -0.015602 0.142242 -0.154828 0.468760 -0.146586 0.157292 0.212403 -0.073760 -0.105926 0.043101 0.167832 -0.099997
polarizability: 3.12433272e+02 -1.04683792e+01 1.59956690e+02 5.10049337e-02 -1.77338784e-01 6.23046517e+01
1716.lowfreq: -2.2565 -0.0005 -0.0003 0.0002 6.2512 7.9603 22.0043 26.4729 36.7087
frequency: 21.7335 26.3328 36.7033 98.2939 102.8280 139.3134 158.2379 196.7887 211.4713 258.3309 263.8678 339.0818 364.6023 390.9788 395.9077 466.6370 471.5812 493.5449 508.3113 534.6494 554.4261 599.3561 632.6409 657.0196 685.5463 695.3752 696.7904 740.7733 767.5757 800.7392 801.7406 819.6388 924.3054 926.4267 978.0338 984.4436 996.2718 1001.0329 1005.9123 1017.4853 1057.9980 1094.8272 1156.0303 1175.1051 1194.4127 1235.3026 1304.1824 1309.7252 1366.8149 1368.4428 1373.1831 1376.4636 1398.1884 1406.2611 1466.7604 1472.5634 1477.4255 1537.0444 1573.6566 1597.7839 1610.6929 1643.6503 1673.5582 2981.0530 3059.3197 3095.2976 3124.8257 3153.3262 3167.9274 3178.5622 3516.5196 3526.9141
redmass: 6.1375 1.2243 3.3468 6.3757 5.4517 6.0532 12.2561 6.6690 3.0105 7.5895 5.9429 4.2337 8.6555 8.0589 4.6182 3.5151 9.8083 7.4424 5.3255 7.8992 3.9592 12.0304 2.9928 5.4247 2.6587 1.9439 6.5085 1.6904 2.0726 6.7674 3.6187 1.7361 1.3243 2.9460 1.3843 5.3168 2.6701 1.3664 2.0294 5.8630 1.5601 1.5127 2.2762 1.1393 8.6488 3.4071 4.7853 1.3550 6.0374 2.6247 3.6289 1.5607 1.5350 2.0288 2.1873 1.0462 1.2128 7.2659 5.6700 5.9121 7.2296 9.1523 5.4055 1.0379 1.0975 1.0987 1.0890 1.0922 1.0933 1.0981 1.0768 1.0774
irintensity: 0.5216 0.8850 0.1452 0.0205 0.5707 0.1195 9.4710 0.7133 1.2558 5.9226 0.3206 9.1259 28.0351 1.1769 2.2529 2.6085 7.9285 55.0074 7.9463 19.0538 1.3360 0.3027 0.2665 0.3853 34.9419 25.5549 9.5246 4.1963 113.2955 17.2264 159.2495 14.3546 0.5056 7.2555 8.3729 6.7152 1.1797 0.0462 6.0865 15.5177 15.3670 24.9807 162.1667 22.4287 47.9985 198.6124 390.1815 24.9121 225.1679 32.2428 14.7416 5.5989 24.9498 9.9698 29.5626 14.6476 18.1979 318.6744 68.0552 206.9170 81.2038 124.7178 649.3475 27.7782 18.3301 10.4544 10.3525 17.8777 32.3374 15.2931 73.8726 81.6337
temp: 298.150 k
press: 1.00000 atm
elementType: 8 8 8 7 7 7 6 6 6 6 6 6 6 6 6 6 6 1 1 1 1 1 1 1 1 1
symmnumber: 1
zpe: 493092.0 jmol-1
zpe.correction: 0.187809 hartree
zpe.thermalcorrener: 0.202523 hartree
zpe.thermalcorrenthalpy: 0.203468 hartree
zpe.thermalcorrgfe: 0.143649 hartree
zpe.sumelectzpe: -813.326267 hartree
zpe.sumelectthermal: -813.311553 hartree
zpe.sumelectthermalent: -813.310608 hartree
zpe.sumelectthermalfe: -813.370427 hartree
dipole: -4.3334 -1.3530 0.0202
dipole: 4.5397
quadrupole: -89.4747 -101.5523 -98.5205
quadrupole: 0.7477 -0.1042 -0.1355
quadrupole: 7.0411 -5.0365 -2.0046 0.7477 -0.1042 -0.1355
hfenergy: -813.5140761 hartree
pointgroup: C01 [X(C11H9N3O3)]
dipole: 1.7304587 -0.2791098 -0.3429781 debye
dipolederiv: -0.6443095 0.0319529 0.0411298 0.1782793 -0.6607519 -0.3439308 0.1834031 -0.3387443 -0.6579768 -0.8091251 0.1170639 0.1271283 0.0000932 -0.5629907 -0.2121919 0.0149636 -0.2152865 -0.5572109 -1.4441587 -0.2261521 -0.1934496 -0.259889 -0.5403407 -0.1575419 -0.2283554 -0.1588403 -0.5231732 1.5886649 0.2321755 0.1748512 0.1581327 -0.2144249 -0.0646445 0.11499 -0.065002 -0.2232156 -1.0588952 -0.4415331 -0.4145984 -0.3275539 -0.7536984 -0.4016946 -0.3044624 -0.3991816 -0.7215403 -1.8471072 0.1228442 0.161916 -0.0738047 -0.4079776 -0.0568466 -0.0311129 -0.061897 -0.4075556 -0.9952855 -0.122437 -0.089221 0.1321412 0.1278932 0.0716777 0.1609615 0.0779766 0.1259329 -1.237046 -0.0845385 -0.0445924 -0.4880341 -0.0639541 -0.0758749 -0.4532421 -0.0890054 -0.0445513 -0.2858921 -0.3070247 -0.3049933 -0.4432587 0.0607371 0.1213159 -0.4620064 0.1268819 0.1071273 0.1692035 0.1921783 0.1871985 -0.2765885 -0.1641523 -0.0704703 -0.275913 -0.0871209 -0.1621399 1.8734323 0.3232732 0.2713483 -0.2315575 0.6890269 0.4819865 -0.267883 0.4652979 0.6764487 1.7159948 -0.0369184 -0.0735758 0.7633595 0.6383037 0.2693792 0.7081868 0.292517 0.6064919 0.3763776 -0.0979337 -0.1130623 0.3036168 -0.0457213 0.0609846 0.2848873 0.0746777 -0.0529396 0.1925505 0.0061002 -0.0068023 0.1203169 -0.0304842 0.0835345 0.1089989 0.0840122 -0.0377769 -0.2544543 0.1721839 0.1781988 0.269384 -0.05194 0.085004 0.2774648 0.0872886 -0.0644505 2.1548468 0.098429 0.0485662 0.0844762 1.0165617 0.6530783 0.0370088 0.6531283 0.9922103 -0.072621 0.0902492 0.1006662 0.0637283 0.0058291 -0.0604559 0.1023495 -0.0777416 -0.0231977 0.241829 0.0021054 -0.0026354 0.0314788 0.1092421 -0.0438944 0.0261362 -0.0416944 0.1093555 0.0837567 0.049516 0.0518208 0.0261313 0.0902785 -0.0698694 0.0278205 -0.0704598 0.0874451 -0.1235452 0.0018113 0.0104028 0.016795 0.1208884 -0.0207755 0.022919 -0.0204272 0.1209593 0.2204365 -0.0347719 -0.0310125 -0.0612116 0.255612 -0.0912266 -0.0570146 -0.0921436 0.2606994 0.1248222 0.0075305 0.0131385 0.048169 0.285143 -0.055807 0.0533269 -0.0545509 0.2851349 0.0012349 -0.0635969 -0.0595243 -0.0800206 0.049139 -0.1074367 -0.0763378 -0.1078386 0.0523817 0.01632 -0.1145562 -0.0910296 -0.0225829 0.0265049 -0.0718243 -0.0155193 -0.0646671 0.0564807 0.0307983 -0.0348999 0.1064788 -0.0488453 0.0155032 0.0770544 0.1242103 0.0228141 -0.0317522 -0.0178283 0.1169486 -0.048347 0.1172446 0.0057731 0.0004701 -0.0757804 0.0600069 0.0268126 unknown
polarizability: 310.7467692|17.0330733|112.4502875|9.2537703|49.5477594|111.4975562 unknown
InChI: InChI=1S/C11H9N3O3/c1-6-3-2-4-7(5-6)12-8-9(15)13-11(17)14-10(8)16/h2-5,13-14H,1H3
charge 0 multiplicity 1
26 atoms
O  -2.280577 1.634324 1.760014
O  -0.418256 -1.574222 -1.451232
O  -4.987528 -1.092883 -0.85784
N  0.035862 0.595134 0.671723
N  -3.580438 0.258489 0.436471
N  -2.669807 -1.275322 -1.096576
C  1.404748 0.431881 0.46867
C  -1.094903 0.110861 0.225071
C  3.487735 -0.475474 -0.50939
C  2.078719 -0.452252 -0.43973
C  -2.322357 0.741454 0.880354
C  -1.325349 -0.95769 -0.820531
C  2.187466 1.292094 1.308152
C  4.235376 0.390063 0.338989
C  3.590387 1.26773 1.241431
C  -3.832914 -0.725102 -0.525354
C  4.202779 -1.403526 -1.476015
H  1.479279 -1.10732 -1.076268
H  1.645948 1.954684 1.989555
H  5.331465 0.372735 0.288835
H  -4.4059 0.680628 0.873537
H  -2.826168 -2.00013 -1.805188
H  4.182943 1.925429 1.885535
H  3.492678 -2.066427 -1.997331
H  4.754824 -0.830071 -2.244482
H  4.940186 -2.039284 -0.9518
