program: Gaussian 09
title: 000242515
version: EM64L-G09RevD.01
frameworkgroup: C1[X(C6H11NO)]
method: RPBEPBE
basis: SDD
operation: Freq
keyword: #p
keyword: freq=noraman
keyword: PBEPBE/SDD
title: #p freq=noraman PBEPBE/SDD
converged: YES YES NO NO
title: Mulliken charges:
elementType: O N C C C C C C H H H H H H H H H H H
charge: -0.302685 -0.124575 -0.015111 -0.479078 -0.421812 -0.015861 -0.362938 -0.723387 0.243612 0.234688 0.210626 0.225977 0.182300 0.250738 0.222870 0.213607 0.224454 0.230335 0.206238
chargesum: 0.00000
title: Mulliken charges with hydrogens summed into heavy atoms:
elementType: O N C C C C C C
charge: -0.302685 -0.124575 0.228501 -0.033764 -0.013534 0.234877 0.073540 -0.062360
polarizability: 8.72090470e+01 -2.72416918e-01 7.04803939e+01 -1.19875005e+00 3.09192450e-01 5.84409590e+01
1716.lowfreq: -19.7844 -13.7582 -3.1456 0.0001 0.0004 0.0008 63.4659 70.3910 127.3466
frequency: 63.3305 70.3371 127.3359 188.4581 256.1309 282.3356 364.6325 384.7998 430.7535 479.1800 692.4705 705.8524 765.3716 815.6637 856.4340 881.1513 927.4377 952.5311 1000.1203 1030.1203 1054.7833 1073.0141 1091.4336 1098.5908 1106.0375 1132.1077 1160.2873 1164.5526 1223.1293 1236.4298 1261.3463 1316.4156 1380.5221 1400.3039 1403.3868 1445.5329 1462.3514 1472.2933 1475.5022 1479.7229 2891.6570 2980.9263 3010.1761 3051.4619 3059.8539 3070.0826 3072.5880 3095.1662 3110.8258 3163.7720 3165.6384
redmass: 4.2691 3.1721 2.5543 1.0930 3.1061 2.8419 2.7034 2.5438 2.5242 2.6266 5.8251 3.7032 3.7167 2.5683 1.6547 1.8197 1.8779 1.3781 1.1931 1.4285 1.5956 1.3286 1.6667 1.4072 1.4736 1.5721 2.0594 2.0296 1.3668 1.5049 1.6348 1.3319 1.3868 1.6646 1.8836 1.0810 1.0493 1.1878 1.0459 1.2244 1.0679 1.0357 1.0903 1.0562 1.0533 1.0908 1.0979 1.0984 1.0913 1.1144 1.1180
irintensity: 5.1051 6.0610 2.1194 0.2756 0.8898 4.8899 0.5653 7.1630 1.7332 7.8079 11.3604 5.8353 5.7283 34.6301 9.0133 6.3013 2.1631 5.2578 0.4169 1.2857 34.0268 3.2110 4.6760 5.1945 12.6475 16.2728 6.8944 0.1046 1.5392 6.6757 13.6967 6.1797 3.8103 37.3984 3.2331 5.4767 12.1619 5.8693 10.4066 2.9549 72.8883 30.7628 30.6590 35.4194 35.0399 4.1405 34.7289 34.4020 14.0713 25.0539 34.9277
temp: 298.150 k
press: 1.00000 atm
elementType: 8 7 6 6 6 6 6 6 1 1 1 1 1 1 1 1 1 1 1
symmnumber: 1
zpe: 420991.8 jmol-1
zpe.correction: 0.160347 hartree
zpe.thermalcorrener: 0.169125 hartree
zpe.thermalcorrenthalpy: 0.170069 hartree
zpe.thermalcorrgfe: 0.126459 hartree
zpe.sumelectzpe: -364.460036 hartree
zpe.sumelectthermal: -364.451258 hartree
zpe.sumelectthermalent: -364.450314 hartree
zpe.sumelectthermalfe: -364.493924 hartree
dipole: 0.6637 -1.9107 -0.5068
dipole: 2.0852
quadrupole: -42.6247 -50.2310 -49.8031
quadrupole: -3.6555 2.6691 2.7448
quadrupole: 4.9283 -2.6781 -2.2502 -3.6555 2.6691 2.7448
hfenergy: -364.620383 hartree
pointgroup: C01 [X(C6H11N1O1)]
dipole: 0.2800485 0.7283659 0.2531928 debye
dipolederiv: -0.3870591 -0.051393 0.0749536 0.0054578 -0.6157102 0.0756638 0.0707587 0.1025553 -0.369007 -0.7349082 -0.1566745 0.0966862 -0.186533 -0.1890876 0.0472057 0.2198836 0.0498068 -0.4088233 0.2875224 0.0933979 0.0073857 0.1266294 0.2017509 0.0677554 -0.0118443 0.0933846 0.1825607 0.1489213 -0.0133269 0.0552414 0.0173021 -0.0980407 -0.0387826 0.0199092 -0.0265679 0.178225 0.5547478 0.139773 0.042401 0.1290873 0.1248035 -0.0710063 0.0526686 -0.0233062 0.209821 0.160909 -0.0333387 -0.0294105 -0.1646538 0.3021159 0.0212308 -0.0580245 0.0268549 0.2807469 0.1585752 0.0120949 -0.0362376 0.1205415 0.1888445 0.1125681 -0.0910941 0.0753028 0.2219427 0.0149449 -0.0232388 -0.0564816 -0.0696843 -0.0276437 -0.0426668 -0.0445288 -0.0358272 0.0299112 0.0172339 -0.0089803 -0.1259213 -0.033957 -0.0017235 0.0242511 -0.0888898 0.0467082 -0.0627116 -0.107816 0.0911955 -0.042863 0.0775142 0.060946 -0.0215525 -0.0747835 0.0158243 0.0455791 0.0233009 -0.0261503 -0.0763877 0.0029356 -0.0000748 -0.1098573 0.021242 -0.1423884 -0.0794899 -0.0459654 -0.0345378 0.0125877 -0.0786733 -0.1305476 0.0735069 0.0260932 0.0770681 0.0596322 -0.0829678 -0.0203702 -0.0145831 -0.0088831 0.0591857 0.0048021 -0.1313936 -0.082852 -0.2065423 0.0928795 0.0217637 -0.0454021 0.0647423 0.0367003 -0.0377014 0.0026322 -0.0161506 -0.1002356 -0.1279347 0.0223808 0.074507 0.0406846 0.0682319 -0.0643625 0.1024505 -0.0483501 0.0414324 0.0268121 -0.0293778 -0.0029159 -0.0840551 0.021229 -0.1137797 -0.049895 -0.1154938 -0.0462521 0.0491795 0.0151339 -0.0781959 0.0646141 0.0468284 0.0987772 -0.1030015 0.0350985 -0.0465927 0.0162338 0.1117243 0.0465235 0.0702311 -0.0792983 -0.0630426 0.0162555 -0.0848329 0.075706 -0.0646091 -0.1100759 0.0981125 -0.0933002 0.0314903 0.0369906 0.121562 0.0531656 -0.0059026 unknown
polarizability: 87.2189141|-0.2201519|70.369772|1.1115967|1.1659431|58.5417138 unknown
InChI: InChI=1S/C6H11NO/c1-5-2-7(5)3-6-4-8-6/h5-6H,2-4H2,1H3
charge 0 multiplicity 1
19 atoms
O  1.662266 -1.141841 0.331738
N  -0.905633 0.733811 -0.453109
C  -1.625799 -0.268835 0.42428
C  -2.031105 1.198649 0.445692
C  0.465982 1.107458 -0.012981
C  1.459399 0.089678 -0.533965
C  2.773383 -0.136932 0.145302
C  -2.450792 -1.327981 -0.280245
H  -1.060179 -0.620349 1.299946
H  -2.940143 1.520663 -0.073452
H  -1.773717 1.78742 1.33831
H  0.699073 2.102316 -0.442855
H  0.574208 1.177315 1.096781
H  1.3671 -0.148786 -1.601429
H  3.629745 -0.494984 -0.439029
H  3.02098 0.443294 1.044375
H  -2.940361 -0.90369 -1.174138
H  -1.808987 -2.166621 -0.606499
H  -3.232821 -1.730986 0.390477
