program: Gaussian 09
title: 000242498
version: EM64L-G09RevD.01
frameworkgroup: C1[X(C21H28O4)]
method: RPBEPBE
basis: SDD
operation: Freq
keyword: #pfreq=noraman
keyword: PBEPBE/SDD
title: #p freq=noraman PBEPBE/SDD
converged: YES YES NO NO
title: Mulliken charges:
elementType: O O O O C C C C C C C C C C C C C C C C C C C C C H H H H H H H H H H H H H H H H H H H H H H H H H H H H
charge: -0.467429 -0.444769 -0.217717 -0.242267 0.355823 -0.098744 -0.194929 -0.138978 0.162889 -0.519227 -0.565761 -0.513432 0.156563 -0.557800 -0.155513 -0.825451 -0.699560 0.495615 0.142096 -0.778648 -0.174784 -0.631042 -0.769783 -0.407569 0.174016 0.211423 0.231690 0.236850 0.232469 0.206287 0.241130 0.231779 0.223565 0.216162 0.272807 0.235358 0.255167 0.232633 0.217300 0.254671 0.229682 0.262877 0.231809 0.248126 0.224319 0.239630 0.344344 0.349431 0.271311 0.267044 0.250703 0.241500 0.256335
chargesum: 0.00000
title: Mulliken charges with hydrogens summed into heavy atoms:
elementType: O O O O C C C C C C C C C C C C C C C C C C C C C
charge: -0.123085 -0.095338 -0.217717 -0.242267 0.355823 0.112679 0.036761 0.097872 0.162889 -0.080471 -0.092852 -0.073705 0.156563 -0.049635 0.099653 -0.120847 -0.207001 0.495615 0.142096 -0.074394 0.064846 -0.359731 -0.010535 -0.151235 0.174016
polarizability: 2.99676746e+02 -1.34505629e+00 2.06849867e+02 -2.81439994e+01 5.62232995e+00 1.89359797e+02
1716.lowfreq: -11.8898 -0.0006 -0.0003 0.0006 3.0743 13.7412 30.0736 42.8145 62.2601
frequency: 30.0554 42.5576 62.1914 68.9855 85.9905 95.2067 118.7427 128.6752 160.3139 165.2541 177.1840 191.6486 197.0951 222.0370 230.8169 235.9024 246.7557 259.2787 260.3298 272.1111 283.4157 295.8657 304.9907 338.2665 344.9112 349.3762 367.6029 394.9801 407.8614 411.7385 430.4768 449.0506 458.6990 474.4130 487.4024 501.8953 525.5599 543.8448 553.6805 578.3355 598.8372 617.5332 632.4491 666.4639 691.6791 696.4984 739.7685 758.0121 791.1305 801.3598 819.2205 826.9297 856.3059 862.7888 881.2751 899.5506 906.9361 910.1744 925.2638 931.8497 936.7394 949.1509 955.3117 977.8162 983.0296 997.9249 1002.1088 1009.0523 1020.0308 1026.9277 1043.7334 1054.5326 1064.2408 1082.9450 1096.8969 1105.7595 1109.3919 1113.1891 1133.1538 1144.3333 1150.2228 1161.2605 1166.4295 1168.8186 1186.2248 1210.9274 1218.5139 1223.0287 1242.0544 1248.7489 1255.2147 1270.3528 1274.5231 1288.0539 1291.3980 1297.6032 1300.8269 1315.7842 1325.7946 1332.0617 1339.0092 1341.4132 1350.1775 1352.3009 1367.7675 1368.5885 1375.4439 1384.3942 1392.0946 1399.5030 1436.0094 1437.0493 1454.3270 1458.8892 1468.2969 1471.2012 1476.5823 1477.9539 1481.2076 1490.2828 1491.2537 1558.3659 1606.5044 1621.0143 1656.1313 2923.9342 2941.9896 2973.5958 2977.5725 2990.0163 2991.7589 2994.0010 2995.8197 2996.3581 2999.2393 3017.3893 3035.1432 3043.0204 3052.4086 3060.5021 3062.1518 3079.9298 3080.2547 3084.2144 3089.1199 3091.2288 3099.8462 3109.6570 3126.2621 3127.6569 3152.0812 3521.4266 3568.6702
redmass: 7.1349 4.3452 4.4685 3.7499 4.0282 5.3004 2.0472 1.1351 6.4383 2.2294 3.5646 3.7492 3.2202 1.3569 1.9177 2.1054 1.7235 1.8470 2.2548 2.8724 2.3296 1.2818 2.9184 2.9670 3.3432 3.5471 3.5397 3.4401 2.7173 2.8515 3.3771 2.7810 3.7026 4.0822 3.7475 3.5783 2.8533 4.0994 3.9661 3.5844 3.3505 3.8480 3.5765 4.8610 2.5089 3.2138 3.3804 3.8282 1.8387 2.9835 1.9836 1.7300 2.3297 2.8022 2.3767 2.1757 2.2056 2.0837 2.1154 2.0251 1.9166 1.9400 1.8901 1.8954 2.6435 1.4598 2.1562 2.0580 1.9173 2.3141 2.1435 2.3584 2.7004 2.6277 2.3174 2.3406 2.2235 1.8808 1.9389 1.6488 1.7692 1.3035 2.0168 2.0412 1.6989 1.7028 1.4798 1.3319 1.5818 1.4146 1.6160 1.4102 1.5963 2.1263 1.5695 1.4272 1.3510 1.3472 1.4333 1.4550 1.9126 1.4665 1.6431 1.6684 1.2515 1.2450 1.3712 1.7034 1.3775 1.1923 1.0571 1.0843 1.0956 1.0650 1.0741 1.0747 1.0830 1.0622 1.0568 1.0695 1.0719 8.6480 8.5255 8.1818 7.2910 1.0798 1.0812 1.0820 1.0604 1.0521 1.0536 1.0444 1.0359 1.0587 1.0484 1.0633 1.0999 1.0872 1.1016 1.0993 1.0992 1.0953 1.0973 1.1026 1.0998 1.0995 1.0978 1.0862 1.0919 1.1029 1.0975 1.0661 1.0658
irintensity: 2.9877 2.6390 1.4743 1.7604 0.9969 3.6059 0.3567 0.0552 0.7925 1.7555 0.2970 4.3617 3.6097 0.6137 7.9942 0.2807 101.1782 64.6421 2.7644 6.4423 21.6500 85.1038 2.7074 2.0616 1.3304 2.9016 4.0558 1.9506 4.1223 0.8967 0.9462 1.6322 1.5784 10.2731 2.4373 2.8393 1.5764 9.8504 3.6054 14.4622 2.9380 0.8770 1.0659 6.1884 3.1311 10.8805 0.8104 1.3201 1.4916 16.2251 15.6795 13.8731 22.8820 3.4438 4.3474 15.1567 16.8532 24.4504 12.7402 2.3055 10.3447 7.6258 32.3129 25.3812 0.2706 1.8112 17.2893 7.6550 17.3199 5.7505 7.7974 8.5198 5.7048 9.0416 17.1689 21.9208 7.0650 12.4316 7.4726 22.6640 7.7281 30.2859 59.3088 53.9251 10.2287 25.2893 9.7388 6.7097 19.2665 1.9082 1.9697 4.3101 32.1235 34.1336 10.0633 3.4989 6.4331 1.5567 3.8580 12.3963 18.3714 2.7920 7.8618 15.0084 71.6261 24.3189 3.0671 6.6930 10.8344 31.9223 15.0087 22.2932 23.7271 3.3621 7.4686 10.2921 9.9674 9.0058 12.4697 3.5038 10.5823 175.9588 13.6410 98.2053 156.4396 10.6503 6.0461 15.2929 31.8614 3.4862 24.3336 13.7276 0.7452 30.5532 51.9572 20.4005 19.0920 38.3163 48.2864 17.1286 18.5863 16.7646 25.4908 23.1369 15.3146 26.5729 18.4122 13.1161 7.5394 17.5024 13.4243 8.1147 4.3190
temp: 298.150 k
press: 1.00000 atm
elementType: 8 8 8 8 6 6 6 6 6 6 6 6 6 6 6 6 6 6 6 6 6 6 6 6 6 1 1 1 1 1 1 1 1 1 1 1 1 1 1 1 1 1 1 1 1 1 1 1 1 1 1 1 1
symmnumber: 1
zpe: 1170801.0 jmol-1
zpe.correction: 0.445935 hartree
zpe.thermalcorrener: 0.470144 hartree
zpe.thermalcorrenthalpy: 0.471088 hartree
zpe.thermalcorrgfe: 0.394414 hartree
zpe.sumelectzpe: -1116.001243 hartree
zpe.sumelectthermal: -1115.977034 hartree
zpe.sumelectthermalent: -1115.976090 hartree
zpe.sumelectthermalfe: -1116.052764 hartree
dipole: -1.0037 -0.5826 2.6267
dipole: 2.8717
quadrupole: -205.8740 -142.8399 -152.6534
quadrupole: 2.6105 21.2535 1.6840
quadrupole: -38.7516 24.2826 14.4690 2.6105 21.2535 1.6840
hfenergy: -1116.4471776 hartree
pointgroup: C01 [X(C21H28O4)]
dipole: -0.3822377 0.2441801 -1.0347709 debye
polarizability: 299.2510776|-0.7583068|206.7635169|29.0941679|5.1674126|189.871815 unknown
InChI: InChI=1S/C21H28O4/c1-12(22)21(25)9-6-16-18-15(5-8-20(16,21)3)19(2)7-4-14(23)10-13(19)11-17(18)24/h4,7,10,15-18,24-25H,5-6,8-9,11H2,1-3H3
charge 0 multiplicity 1
53 atoms
O  -3.352994 0.126074 1.993582
O  1.023274 -2.374005 1.180061
O  -5.432686 0.353211 -0.874458
O  5.86729 0.349285 1.643094
C  -2.190672 0.310005 -0.25522
C  -1.287903 -0.922908 0.073725
C  0.102564 -0.852912 -0.588217
C  0.819124 0.453961 -0.115317
C  -3.50642 -0.118175 0.540336
C  -1.483611 1.589784 0.244198
C  -2.200853 -2.143146 -0.195532
C  -0.058954 1.713054 -0.364029
C  2.300353 0.575075 -0.71075
C  -3.624243 -1.647325 0.231464
C  0.941351 -2.118712 -0.272249
C  -2.51082 0.424146 -1.770642
C  2.36011 -2.005119 -0.88821
C  3.023372 -0.735918 -0.393461
C  -4.756888 0.690372 0.135331
C  2.281367 0.800228 -2.26302
C  3.001826 1.774964 -0.100821
C  4.156952 -0.784851 0.375809
C  -5.123104 1.896375 0.978328
C  4.142211 1.712103 0.644017
C  4.804236 0.420191 0.9415
H  -1.079792 -0.905144 1.168029
H  -0.023153 -0.828792 -1.691239
H  0.946676 0.365316 0.986838
H  -1.422114 1.565014 1.349233
H  -2.064424 2.493628 -0.026499
H  -1.878921 -3.029823 0.376643
H  -2.184952 -2.416305 -1.267808
H  -0.14063 1.909083 -1.450036
H  0.427925 2.59946 0.082605
H  -4.367261 -1.800103 -0.569236
H  -3.999589 -2.16908 1.130144
H  0.427716 -3.010409 -0.671692
H  -3.087459 1.343036 -1.97774
H  -1.588819 0.470708 -2.374995
H  -3.115979 -0.41979 -2.139772
H  2.260843 -2.000253 -1.991131
H  2.955558 -2.892393 -0.609498
H  1.847052 1.78422 -2.511182
H  3.31075 0.776373 -2.660882
H  1.691742 0.027739 -2.786003
H  2.554929 2.753825 -0.319671
H  -2.67629 -0.502615 2.349886
H  1.794263 -1.870282 1.550626
H  4.648029 -1.741599 0.595032
H  -5.437052 1.558034 1.982503
H  -4.245005 2.545094 1.14498
H  -5.938589 2.455778 0.494268
H  4.619555 2.611926 1.048883
