program: Gaussian 09
title: 000242487
version: EM64L-G09RevD.01
frameworkgroup: C1[X(C19H28O2)]
method: RPBEPBE
basis: SDD
operation: Freq
keyword: #pfreq=noraman
keyword: PBEPBE/SDD
title: #p freq=noraman PBEPBE/SDD
converged: YES YES NO NO
title: Mulliken charges:
elementType: O O C C C C C C C C C C C C C C C C C C C H H H H H H H H H H H H H H H H H H H H H H H H H H H H
charge: -0.175759 -0.433881 -0.086917 -0.175638 -0.110055 0.435431 0.261756 -0.541583 -0.528610 -0.492647 -0.638227 -0.636558 0.500458 -0.506316 -0.805557 0.120853 -0.481301 -0.829650 -0.682182 -0.466673 -0.066986 0.195315 0.244508 0.202291 0.228485 0.216599 0.200691 0.208657 0.220308 0.213930 0.252473 0.255687 0.251169 0.248818 0.209517 0.213718 0.227484 0.220764 0.230934 0.213661 0.226392 0.223943 0.220659 0.243135 0.197922 0.189541 0.228067 0.235002 0.320373
chargesum: 0.00000
title: Mulliken charges with hydrogens summed into heavy atoms:
elementType: O O C C C C C C C C C C C C C C C C C C C
charge: -0.175759 -0.113508 0.108398 0.068870 0.092236 0.435431 0.261756 -0.096500 -0.119262 -0.058410 -0.130066 -0.136570 0.500458 -0.083081 -0.126375 0.120853 -0.267639 -0.158657 -0.241125 -0.049066 0.168016
polarizability: 2.51698514e+02 -9.21725211e+00 1.89983762e+02 4.31555936e+00 1.89668513e-01 1.53361980e+02
1716.lowfreq: -17.6300 -5.1281 -0.0005 -0.0001 0.0005 3.5668 37.7450 53.7643 83.4123
frequency: 37.2802 53.5833 83.3233 94.2075 114.3597 137.1560 179.2565 196.2356 214.4824 223.1999 231.5818 232.3505 256.5597 274.1707 280.4216 291.1471 303.6600 313.0536 344.2717 347.3360 383.0312 400.3675 410.2784 423.4000 441.0655 450.2316 461.6902 477.0844 478.9354 521.5485 528.6726 570.9267 587.2558 601.9111 620.4488 686.4092 718.2829 754.4075 772.4697 794.3316 805.4134 819.8072 832.6923 836.1611 864.9931 881.5169 909.1762 916.5044 932.7006 941.4407 955.4475 971.7229 976.7165 985.9449 997.7871 1007.8287 1016.2565 1025.7958 1028.4429 1069.5122 1072.1675 1080.4785 1100.6483 1116.0034 1120.2885 1126.1329 1138.5867 1140.0226 1148.6916 1153.5680 1159.2875 1172.8940 1184.1687 1185.9450 1195.9099 1203.8294 1212.8914 1238.6117 1246.1861 1254.9553 1265.6473 1270.1732 1280.1917 1292.5921 1298.6685 1307.9891 1321.6484 1325.3393 1330.4763 1331.0987 1337.8365 1343.6178 1345.2259 1353.6999 1359.5965 1369.5128 1372.8553 1383.9579 1396.7041 1425.3518 1435.9230 1454.1895 1455.3865 1457.3093 1463.4853 1469.2652 1473.3806 1479.9313 1482.5546 1488.3498 1497.5736 1659.4235 1682.8657 2909.6475 2920.9701 2928.2762 2936.2673 2957.3788 2963.5376 2966.2997 2969.5461 2971.2880 2978.8610 2979.9517 2986.1572 2987.7008 2998.4807 3018.0622 3028.9559 3031.9670 3041.6757 3042.5315 3054.7043 3061.7104 3063.2807 3065.5140 3070.2524 3076.8461 3087.0127 3087.2695 3540.6640
redmass: 5.6807 3.3265 4.3082 3.7360 3.8735 2.6454 1.3800 3.1623 1.3369 2.3902 2.0851 2.8830 2.3462 2.0308 1.9047 2.2415 1.7007 2.5900 2.4276 2.2358 3.1271 3.0698 3.8436 2.8011 3.8316 1.9327 2.1142 3.6035 2.7683 3.0231 2.7565 3.8271 2.7678 3.0503 3.3338 3.1274 2.8859 2.6067 3.1905 1.9644 1.7111 2.1190 1.8184 2.3584 1.8797 1.6309 1.9774 1.6797 1.7192 1.8808 1.6999 2.0380 2.1669 2.1294 2.4243 1.8369 2.0723 1.7666 1.9474 1.8474 2.5208 2.6633 2.4163 1.7399 1.9517 2.2824 1.5625 2.1315 1.5518 1.5455 2.0081 1.8400 1.7991 1.8254 2.2676 1.5885 1.9059 1.5477 1.3749 1.7636 1.4380 1.4184 1.6127 1.3107 1.5246 1.5375 1.4330 1.3841 1.4165 1.4680 1.4311 1.4228 1.6106 1.4197 1.3675 1.3414 1.3835 1.2575 1.1934 1.0861 1.0940 1.0842 1.0897 1.0776 1.0756 1.0876 1.0850 1.0678 1.0580 1.0552 1.0621 12.0885 7.8111 1.0809 1.0810 1.0663 1.0664 1.0610 1.0655 1.0621 1.0781 1.0676 1.0398 1.0406 1.0624 1.0605 1.0918 1.0981 1.0889 1.0948 1.0948 1.1009 1.0959 1.0973 1.0958 1.0969 1.0989 1.0978 1.0944 1.0927 1.0657
irintensity: 2.0414 0.5864 3.8443 2.4289 0.5334 0.6444 1.3832 1.5906 0.9152 1.0871 4.1760 0.8715 0.0437 10.8567 1.3193 19.9685 28.5677 0.3294 67.3916 1.0176 0.5796 1.6683 0.1760 1.1613 2.4992 2.9582 0.5220 0.7439 1.6168 6.2876 0.2472 5.2882 1.3162 1.9865 3.9195 0.7344 3.7050 1.6568 3.4731 1.7402 11.4187 0.2642 8.4949 11.0648 2.5644 2.0787 5.2232 7.7424 2.7347 15.7824 11.7276 42.7205 25.3369 2.1721 34.8159 6.2205 25.6379 11.7965 11.9057 6.1835 5.4668 1.0115 28.2382 13.9821 2.6368 20.1042 2.2825 6.9895 0.2100 1.3176 57.6153 4.0505 1.9494 6.1391 6.1800 5.9328 4.0745 8.2950 0.0562 4.4239 5.9579 18.9357 2.7557 2.3940 4.7575 1.5721 1.4171 1.1277 1.3242 1.5201 0.7361 1.3846 1.2691 0.4568 11.2486 8.9723 29.0049 17.8967 26.7246 21.4812 11.3754 13.4294 7.3341 1.4350 6.1629 12.7659 2.1928 19.1358 9.0146 1.9211 8.0348 249.9267 2.6174 11.5778 14.9697 39.1317 34.4326 41.8107 15.0642 34.8001 12.9318 38.3115 31.1044 3.4008 14.3963 25.3727 47.0504 32.2931 14.4508 53.8259 46.4692 31.4783 56.1268 26.2242 24.8916 6.9172 32.5981 47.1697 63.4658 18.4979 7.6588
temp: 298.150 k
press: 1.00000 atm
elementType: 8 8 6 6 6 6 6 6 6 6 6 6 6 6 6 6 6 6 6 6 6 1 1 1 1 1 1 1 1 1 1 1 1 1 1 1 1 1 1 1 1 1 1 1 1 1 1 1 1
symmnumber: 1
zpe: 1126009.8 jmol-1
zpe.correction: 0.428874 hartree
zpe.thermalcorrener: 0.448561 hartree
zpe.thermalcorrenthalpy: 0.449505 hartree
zpe.thermalcorrgfe: 0.382936 hartree
zpe.sumelectzpe: -889.634785 hartree
zpe.sumelectthermal: -889.615099 hartree
zpe.sumelectthermalent: -889.614155 hartree
zpe.sumelectthermalfe: -889.680724 hartree
dipole: 1.7069 -2.4871 1.1914
dipole: 3.2433
quadrupole: -172.6688 -127.0394 -125.1958
quadrupole: 4.6379 7.9074 0.7753
quadrupole: -31.0341 14.5952 16.4389 4.6379 7.9074 0.7753
hfenergy: -890.0636593 hartree
pointgroup: C01 [X(C19H28O2)]
dipole: 0.6723275 -0.9699212 0.4852139 debye
polarizability: 251.7111448|-9.1885235|189.9936254|4.1650796|-0.4870836|153.3394858 unknown
InChI: InChI=1S/C19H28O2/c1-18-7-6-16-15(17(18)10-14(21)11-18)4-3-12-9-13(20)5-8-19(12,16)2/h3,13,15-17,20H,4-11H2,1-2H3
charge 0 multiplicity 1
49 atoms
O  -5.654169 1.255577 -0.254094
O  5.999663 0.475102 -0.33136
C  0.221525 -0.536748 -0.313286
C  -0.679354 0.600459 0.268135
C  -2.110097 0.445518 -0.280529
C  -2.763311 -0.947821 0.023242
C  1.694467 -0.47885 0.249885
C  -0.424379 -1.948052 -0.174805
C  -1.894292 -2.023057 -0.668797
C  -0.095145 1.98151 -0.111336
C  -3.198112 1.469088 0.11344
C  -4.187626 -0.736496 -0.559152
C  2.218496 0.973241 0.228766
C  2.614051 -1.347391 -0.679627
C  -2.899673 -1.242468 1.54299
C  -4.513069 0.737133 -0.234586
C  1.406193 2.050534 0.052136
C  1.770882 -1.017095 1.713203
C  3.719679 1.166133 0.419318
C  4.129736 -1.184944 -0.418412
C  4.551459 0.289316 -0.544792
H  0.302245 -0.322409 -1.404632
H  -0.696887 0.525505 1.375346
H  -2.019001 0.493387 -1.391707
H  -0.391847 -2.274945 0.881223
H  0.176112 -2.683553 -0.743086
H  -1.927847 -1.862244 -1.766968
H  -2.294811 -3.038952 -0.479296
H  -0.573116 2.774729 0.498565
H  -0.362004 2.217127 -1.166434
H  -3.145976 2.436847 -0.414675
H  -3.190515 1.695639 1.198747
H  -4.966312 -1.409371 -0.15959
H  -4.186468 -0.851105 -1.663971
H  2.407932 -1.066652 -1.73344
H  2.340927 -2.414472 -0.573376
H  -3.53643 -0.496043 2.052666
H  -3.373443 -2.231625 1.688063
H  -1.927579 -1.259532 2.06378
H  1.858899 3.053017 0.02428
H  1.001275 -0.544795 2.349726
H  1.629787 -2.112649 1.751147
H  2.75041 -0.798737 2.172681
H  3.992632 2.227584 0.279204
H  4.015819 0.893687 1.45733
H  4.388152 -1.55002 0.59823
H  4.707687 -1.796518 -1.136254
H  4.40325 0.633168 -1.584435
H  6.217387 0.18104 0.590739
