program: Gaussian 09
title: 000242483
version: EM64L-G09RevD.01
frameworkgroup: C1[X(C23H32O5)]
method: RPBEPBE
basis: SDD
operation: Freq
keyword: #pfreq=noraman
keyword: PBEPBE/SDD
title: #p freq=noraman PBEPBE/SDD
converged: YES YES NO NO
title: Mulliken charges:
elementType: O O O O O C C C C C C C C C C C C C C C C C C C C C C C H H H H H H H H H H H H H H H H H H H H H H H H H H H H H H H H
charge: -0.279054 -0.275501 -0.214102 -0.179364 -0.237008 0.349877 -0.150265 -0.150176 -0.101565 0.117725 -0.554212 -0.584166 0.227839 -0.520063 -0.051559 -0.487586 -0.832488 0.542450 -0.642177 -0.493372 0.181223 -0.811532 -0.563078 -0.587537 -0.445913 -0.239887 0.178117 -0.513961 0.271816 0.226936 0.204662 0.238168 0.225049 0.238563 0.221819 0.223146 0.220880 0.188759 0.220695 0.219511 0.208342 0.257566 0.259511 0.221744 0.234429 0.219339 0.214974 0.233428 0.219525 0.232786 0.245474 0.231501 0.254530 0.264727 0.233079 0.239796 0.182802 0.202445 0.220571 0.240764
chargesum: 0.00000
title: Mulliken charges with hydrogens summed into heavy atoms:
elementType: O O O O O C C C C C C C C C C C C C C C C C C C C C C C
charge: -0.279054 -0.275501 -0.214102 -0.179364 -0.237008 0.349877 0.121551 0.076760 0.103097 0.117725 -0.090994 -0.123785 0.227839 -0.076037 0.137200 -0.047380 -0.107069 0.542450 -0.186004 -0.059058 0.181223 -0.125793 -0.086104 -0.333007 0.051892 0.182711 0.178117 0.149819
polarizability: 3.24804213e+02 -1.16107505e+01 2.25726953e+02 -1.50675976e+01 -4.59176519e+00 2.13265619e+02
1716.lowfreq: -6.3084 -2.9169 -0.0010 -0.0004 0.0003 5.8031 27.7957 39.0732 59.0650
frequency: 27.7557 39.0569 59.0215 62.9159 74.9966 80.0675 91.0318 117.3818 125.3486 146.8011 158.6598 171.3448 173.7619 177.4111 199.4402 209.4163 213.0946 221.2442 248.8535 258.0461 264.3233 272.2131 288.0936 299.4066 315.4635 319.5786 325.1550 366.2553 376.3123 387.8471 401.0835 411.4033 417.8726 438.6736 448.9645 460.1230 477.8560 491.5900 503.8892 528.3932 539.5771 545.0777 560.2712 565.9241 595.8537 638.8712 647.6623 665.0265 676.6461 703.5061 738.5871 775.2832 808.7569 814.0921 831.0311 846.0629 855.1114 864.2065 880.9261 886.6101 901.6705 917.1727 920.7894 932.1315 942.7073 948.8658 954.7273 962.7607 970.7942 983.4890 1006.6899 1011.2706 1016.9343 1026.0892 1031.5124 1033.3996 1049.4758 1054.6197 1065.8706 1075.6100 1078.3137 1106.4372 1110.9198 1114.8451 1116.1244 1119.9986 1127.8707 1138.7478 1146.3705 1157.4607 1163.7910 1175.8989 1179.7899 1187.0212 1190.2712 1203.0175 1213.4936 1232.0712 1234.8925 1237.0350 1248.7687 1257.0590 1270.0826 1274.4744 1278.9988 1283.9083 1285.1103 1304.1167 1313.3969 1318.4065 1319.4826 1322.2098 1325.7625 1335.1537 1337.2470 1343.5857 1349.8440 1355.2909 1359.5300 1373.7072 1376.5423 1390.1490 1402.9988 1433.4829 1443.5850 1444.2346 1455.4965 1456.9010 1459.8758 1462.2536 1463.8004 1466.2107 1467.7998 1472.5936 1476.8349 1478.1919 1480.5074 1487.1220 1498.8201 1584.5312 1622.7870 1646.4477 2912.6195 2918.2881 2936.2049 2946.3330 2951.6795 2951.7318 2959.4186 2965.1697 2974.7407 2977.7693 2979.5867 2985.6984 2989.0987 2994.3730 2998.6464 3001.7780 3019.9796 3030.8879 3038.5183 3040.1297 3046.7722 3059.3458 3060.9284 3067.1596 3077.0480 3082.6347 3084.4693 3110.1609 3113.6523 3115.6798 3120.0870 3125.3587
redmass: 6.2721 4.3065 5.3380 6.0623 3.2443 4.8305 2.5513 3.3766 2.2945 3.4215 3.3148 3.2811 2.8009 1.5163 1.4890 2.2959 1.6382 1.9705 2.6315 3.7651 2.7060 2.6389 2.9746 3.0422 3.7045 3.2867 3.0201 3.6702 2.9931 2.8671 2.6421 3.4996 3.6557 3.1190 3.6969 3.5637 2.9953 3.0820 3.9307 2.7802 2.9167 3.4688 4.0948 3.2395 3.7147 3.4978 3.1951 3.3127 3.7628 4.2073 2.9461 2.1769 2.2325 2.4258 2.2334 3.3741 3.3248 2.9078 2.0614 1.9826 2.9848 1.9861 2.1997 1.8673 2.0547 4.9055 1.9811 3.8260 2.4054 2.3924 2.0583 2.3658 2.1745 2.5493 2.0337 2.4541 3.5965 2.6876 3.0016 2.2789 3.1152 1.8045 1.5132 1.6357 2.2441 2.0352 1.9899 1.5708 1.7729 2.0418 1.7033 1.5280 1.4230 1.8390 1.7976 2.2068 1.7498 1.4871 1.6294 1.9854 1.5407 1.2208 1.5644 1.4916 2.0541 1.3984 1.3561 1.3730 1.2694 1.3338 1.3867 1.4699 1.4103 1.3271 1.4886 2.1648 1.4235 1.4461 1.3842 1.1899 1.3209 1.2147 1.1732 1.1324 1.0751 1.0787 1.0871 1.0606 1.0879 1.0799 1.0804 1.0861 1.0708 1.0769 1.0569 1.0736 1.0550 1.0626 1.0563 10.0217 7.7058 11.1655 1.0684 1.0814 1.0361 1.0811 1.0667 1.0665 1.0779 1.0646 1.0669 1.0762 1.0645 1.0388 1.0563 1.0545 1.0534 1.0533 1.1004 1.0981 1.0972 1.1002 1.0982 1.1020 1.0953 1.1027 1.0988 1.0990 1.0987 1.0985 1.0978 1.0911 1.0956 1.0961
irintensity: 1.4637 2.6762 2.2462 2.1335 0.4818 1.5003 3.4325 2.8561 2.3636 0.9390 6.1498 1.8975 0.5955 1.0751 0.6971 1.8570 1.0348 1.6218 0.1624 0.1525 0.7780 0.3632 3.1123 4.5198 1.4042 0.3988 2.4930 7.8395 2.3187 0.3804 8.6440 6.0314 2.2408 2.8226 2.5704 9.7473 0.8031 6.8918 6.6585 0.0517 2.3902 2.9170 9.9444 4.2049 0.6996 3.7910 3.2566 6.2113 4.6859 10.6561 3.5870 5.3176 0.6672 5.5928 6.0038 6.4687 16.6522 30.1484 7.0029 20.3661 20.0758 0.8856 12.7195 17.7544 45.7022 150.8338 2.7876 36.5626 7.8069 13.4490 0.4773 33.0698 16.2474 16.2596 13.8288 22.6012 56.4155 4.9085 26.8512 1.1213 20.1347 8.8673 3.7135 3.6856 2.7469 2.3614 3.9366 3.2639 4.3105 8.7234 10.0635 2.4098 14.0510 20.3785 2.5424 3.1281 13.6088 13.4489 23.6142 27.2304 7.4965 2.0518 8.5295 3.8134 37.3173 2.7837 8.5896 0.3833 5.8102 15.1314 6.2709 7.3699 3.7077 2.4630 1.5518 6.5899 1.3678 3.3605 3.7405 7.6347 2.2855 19.1001 31.7276 4.3264 13.2531 17.1306 18.2168 14.5235 5.9856 17.3090 0.0670 7.4804 1.9287 8.9839 9.4148 4.3743 5.1183 6.5770 9.0053 162.2961 208.0938 98.0805 77.9381 11.2862 70.8627 57.2937 20.6136 29.6852 1.0886 24.9414 7.5011 17.4319 50.7277 12.8841 17.9715 21.6049 41.2454 23.0771 55.5457 50.9896 21.5602 36.2615 41.0340 24.1811 24.9316 33.0703 41.5965 26.3829 19.9615 23.5801 7.6779 11.5423 10.3292 12.7706
temp: 298.150 k
press: 1.00000 atm
elementType: 8 8 8 8 8 6 6 6 6 6 6 6 6 6 6 6 6 6 6 6 6 6 6 6 6 6 6 6 1 1 1 1 1 1 1 1 1 1 1 1 1 1 1 1 1 1 1 1 1 1 1 1 1 1 1 1 1 1 1 1
symmnumber: 1
zpe: 1336787.6 jmol-1
zpe.correction: 0.509156 hartree
zpe.thermalcorrener: 0.535605 hartree
zpe.thermalcorrenthalpy: 0.536549 hartree
zpe.thermalcorrgfe: 0.454559 hartree
zpe.sumelectzpe: -1269.555650 hartree
zpe.sumelectthermal: -1269.529201 hartree
zpe.sumelectthermalent: -1269.528257 hartree
zpe.sumelectthermalfe: -1269.610247 hartree
dipole: -4.7342 4.7534 -0.0485
dipole: 6.7090
quadrupole: -213.1911 -161.3588 -171.6285
quadrupole: -14.8969 25.8981 -2.5288
quadrupole: -31.1316 20.7006 10.4309 -14.8969 25.8981 -2.5288
hfenergy: -1270.064806 hartree
pointgroup: C01 [X(C23H32O5)]
dipole: -1.8023548 1.9281282 -0.0300222 debye
polarizability: 324.0877622|-14.7363984|226.5444645|-14.7403728|-4.1970192|213.164558 unknown
InChI: InChI=1S/C23H32O5/c1-21-8-6-15(24)10-14(21)4-5-16-17(21)7-9-22(2)18(16)11-20(26-3)23(22)19(25)12-27-13-28-23/h10,16-18,20H,4-9,11-13H2,1-3H3
charge 0 multiplicity 1
60 atoms
O  -2.604957 -0.939502 -1.448661
O  -3.979671 1.808401 0.556991
O  -4.864812 -1.781175 -1.595395
O  -4.005923 -1.334454 1.740703
O  6.954043 -0.643531 -1.351157
C  -1.397221 -0.30139 0.59925
C  -0.61336 0.744164 -0.262271
C  0.842748 0.967532 0.193819
C  1.585712 -0.40801 0.17392
C  -2.785611 -0.236628 -0.12175
C  -0.657965 -1.656527 0.529132
C  -1.577672 1.956461 -0.307961
C  3.117462 -0.311498 0.573001
C  0.815024 -1.488614 0.986849
C  -2.99302 1.302803 -0.407993
C  1.567496 1.981501 -0.718736
C  -1.553957 0.170863 2.07795
C  3.780324 0.810896 -0.246612
C  3.052173 2.140629 -0.313936
C  3.799481 -1.677818 0.24679
C  -4.001886 -0.908842 0.562883
C  3.300403 0.022064 2.088764
C  5.34058 -1.6215 0.214425
C  4.995875 0.659135 -0.866051
C  -5.234834 -1.092331 -0.338202
C  -3.810395 -1.037039 -2.25778
C  5.845372 -0.541618 -0.740425
C  -4.397834 3.184947 0.279768
H  -0.560952 0.321277 -1.288126
H  0.848624 1.372941 1.227539
H  1.576251 -0.738178 -0.891594
H  -0.686701 -2.035514 -0.509142
H  -1.16215 -2.405767 1.168784
H  -1.507828 2.537203 0.631584
H  -1.374847 2.637863 -1.152061
H  0.835189 -1.234748 2.063789
H  1.322274 -2.46557 0.883613
H  -3.403256 1.439302 -1.432815
H  1.068634 2.968685 -0.671015
H  1.505626 1.635352 -1.771255
H  -0.599149 0.559234 2.472237
H  -2.312604 0.964536 2.184284
H  -1.87788 -0.668572 2.711648
H  3.087721 2.618558 0.688669
H  3.577238 2.823031 -1.007029
H  3.439713 -2.02101 -0.744637
H  3.480442 -2.436972 0.984319
H  4.369011 0.158092 2.333867
H  2.774772 0.949568 2.376998
H  2.911188 -0.797055 2.718646
H  5.77499 -2.591446 -0.086087
H  5.744266 -1.394493 1.222595
H  5.419558 1.476945 -1.46419
H  -5.970001 -1.733891 0.168154
H  -5.679214 -0.096601 -0.557201
H  -3.526725 -1.615571 -3.147716
H  -4.188317 -0.024573 -2.530618
H  -4.822297 3.276775 -0.74288
H  -3.55497 3.896915 0.384668
H  -5.172585 3.423667 1.024656
