program: Gaussian 09
title: 000242481
version: EM64L-G09RevD.01
frameworkgroup: C1[X(C22H32O5)]
method: RPBEPBE
basis: SDD
operation: Freq
keyword: #pfreq=noraman
keyword: PBEPBE/SDD
title: #p freq=noraman PBEPBE/SDD
converged: NO YES NO NO
title: Mulliken charges:
elementType: O O O O O C C C C C C C C C C C C C C C C C C C C C C H H H H H H H H H H H H H H H H H H H H H H H H H H H H H H H H
charge: -0.443854 -0.295892 -0.243056 -0.451315 -0.234739 0.342702 -0.079305 -0.167157 -0.106758 0.058787 -0.549322 0.229347 -0.591327 -0.527310 -0.067882 -0.484946 -0.843633 0.539835 -0.642586 -0.493423 -0.809337 0.085057 -0.563408 -0.586027 0.178550 -0.376331 -0.516097 0.247279 0.232784 0.204553 0.169650 0.259926 0.234273 0.227470 0.225925 0.227367 0.232106 0.224375 0.220479 0.214671 0.262744 0.258872 0.222623 0.236188 0.218494 0.215594 0.234989 0.220500 0.229713 0.347377 0.246107 0.231791 0.255605 0.247419 0.261081 0.238875 0.210169 0.218931 0.361495
chargesum: 0.00000
title: Mulliken charges with hydrogens summed into heavy atoms:
elementType: O O O O O C C C C C C C C C C C C C C C C C C C C C C
charge: -0.096477 -0.295892 -0.243056 -0.089820 -0.234739 0.342702 0.167974 0.065626 0.097794 0.058787 -0.119745 0.229347 -0.129584 -0.074018 0.164224 -0.040092 -0.107346 0.539835 -0.183776 -0.059335 -0.124135 0.085057 -0.085510 -0.330422 0.178550 0.132169 0.151879
polarizability: 3.26761939e+02 -1.04809698e+01 2.27826973e+02 -1.44480376e+01 -5.43598590e+00 1.88357514e+02
1716.lowfreq: -11.3459 -4.4444 -0.0006 0.0002 0.0003 12.4550 28.2547 43.0397 48.0360
frequency: 27.9034 43.0222 47.9889 64.4283 71.5650 83.6450 89.3882 94.1785 137.8986 141.0129 158.0240 170.3826 178.0345 185.5247 201.1237 207.6555 221.4797 238.1738 241.8836 254.3084 259.0598 265.3814 280.6416 292.3079 303.4491 316.1354 317.6396 333.2663 343.0861 357.5249 369.0437 383.0182 391.4082 404.8841 409.5134 441.7612 445.7570 457.6153 486.2791 491.1420 513.2514 528.1847 538.5967 559.0781 582.2838 595.0047 636.6366 649.2967 669.5963 679.5753 734.2534 756.7614 776.8347 805.1914 813.6273 830.3653 842.0611 862.3070 881.4544 890.9915 914.0885 917.9118 922.0051 932.6000 940.6585 951.5975 963.6757 969.0541 983.9004 998.5472 1007.2776 1017.2890 1025.0590 1030.3598 1033.9098 1042.2618 1047.9243 1068.8570 1076.0409 1081.3080 1112.4375 1114.9350 1115.4700 1120.7566 1124.3954 1131.1745 1143.7408 1157.7525 1158.7640 1175.1530 1183.8782 1185.3041 1189.6441 1196.0222 1208.8658 1217.2875 1232.1152 1237.3287 1248.0682 1254.9998 1262.6869 1273.7544 1276.1663 1279.2935 1285.4012 1288.0274 1306.1923 1320.3194 1323.2748 1330.8733 1332.3029 1335.5596 1342.8270 1344.9475 1348.3587 1353.0687 1357.5720 1369.4922 1373.6604 1388.4995 1397.2753 1434.3228 1446.4206 1450.5880 1456.5216 1457.9037 1462.9113 1465.1929 1466.6134 1468.1288 1470.5518 1477.7802 1480.9430 1487.4638 1493.0162 1502.9350 1585.3596 1590.1549 1625.2729 2918.8518 2939.4233 2943.1789 2948.3610 2951.9135 2962.0963 2971.3055 2974.7196 2974.8322 2977.7121 2980.9803 2988.2064 2996.1796 2997.5984 3001.3447 3020.2939 3032.3448 3033.5988 3040.4556 3042.0445 3046.2387 3053.6565 3063.3196 3069.6419 3081.1382 3085.1128 3090.8706 3100.9457 3109.8811 3118.4175 3433.0961 3537.7451
redmass: 6.4179 4.0839 5.7234 4.7685 4.2513 3.9334 3.6266 2.5949 3.6644 2.8631 3.4858 1.9706 3.4810 1.4900 3.2262 1.7298 1.3911 2.2513 2.4990 3.1732 2.6840 2.5352 2.6350 2.5808 3.2178 2.8908 3.4398 1.6182 2.3927 3.4018 2.6220 2.4143 2.6652 1.6777 3.8454 3.4042 3.1336 3.1766 2.6142 3.1905 3.0160 2.8331 2.8157 2.6821 3.1763 3.5363 3.5542 3.4159 3.1848 3.2741 3.3288 3.9167 2.1803 2.2115 2.8159 2.2015 2.7943 2.3431 1.9408 1.8855 3.1672 2.0474 2.1856 1.7549 2.2921 2.1857 2.4319 2.3522 2.3296 2.3404 1.9800 2.3362 2.6016 2.2189 2.0558 3.3436 2.5974 2.9278 2.2521 2.8528 1.5653 2.3333 1.4576 2.0990 2.0885 1.9327 1.4413 1.5517 2.0774 1.4104 1.4381 1.3290 1.9263 1.9762 2.1161 1.6479 1.4532 1.6732 1.4437 1.6655 1.6715 1.7091 1.3978 2.0437 1.4021 1.4872 1.3677 1.4209 1.4594 1.3701 1.3851 1.3691 1.4115 1.8904 1.4335 1.4213 1.4054 1.4998 1.3723 1.2079 1.1826 1.1327 1.0783 1.0759 1.0629 1.0851 1.0779 1.0822 1.0867 1.0886 1.0770 1.0520 1.0561 1.0587 1.0673 1.0561 10.0103 8.3900 7.7318 1.0809 1.0339 1.0683 1.0772 1.0665 1.0728 1.0714 1.0718 1.0652 1.0730 1.0630 1.0373 1.0523 1.0586 1.0460 1.1020 1.0985 1.0982 1.0964 1.0980 1.0937 1.1010 1.0957 1.1015 1.0989 1.0988 1.0986 1.0989 1.0985 1.0912 1.0641 1.0656
irintensity: 2.6384 1.2346 1.5858 1.9700 1.1429 2.8075 2.5129 3.6785 1.1947 4.6991 4.7996 1.5054 1.5898 2.1117 2.4523 1.2227 0.5593 1.6731 1.9469 1.6320 5.0508 0.3382 0.7734 2.9422 0.0971 7.5676 35.5851 115.4343 51.0769 52.6043 10.1634 19.7390 17.7712 66.9940 0.5365 8.4297 7.6325 0.7863 1.2042 9.1770 9.8672 0.1991 1.8507 1.9358 4.4354 1.7461 0.1500 3.0228 8.3509 0.9094 7.2537 5.5533 4.9682 0.6781 13.8660 23.1401 11.5963 9.4409 6.2323 45.3097 93.2773 3.8392 30.8444 9.9272 7.3400 14.7458 19.8277 4.5038 3.2631 14.4452 4.4626 37.6702 36.4900 31.1610 8.8090 59.2510 14.5081 17.3462 1.9891 9.0204 3.5915 7.8786 2.2897 0.5969 2.0171 4.0760 2.6074 11.0693 2.6232 12.5408 6.1399 2.5244 26.2345 0.1900 1.5505 11.1350 17.9776 27.9714 8.9691 55.4379 105.8656 18.2979 5.3491 33.7628 2.6639 12.5061 4.4675 3.1155 6.7313 11.4041 10.6128 1.9888 1.0865 6.7147 1.5394 0.8497 4.5948 2.6796 64.8820 15.1996 33.1628 2.7876 18.7943 15.0179 11.5753 22.2015 5.5003 2.3223 11.3072 8.0891 2.1327 12.0609 5.9676 5.7739 3.2313 10.1229 164.7677 66.3188 202.7337 9.8313 74.1743 29.6461 6.7940 15.1146 15.7209 38.8715 19.6796 38.0198 19.3281 25.4958 17.1660 3.0472 33.2817 27.6031 54.4545 48.0041 9.2752 18.5863 34.9191 43.8648 30.7064 21.9235 27.8680 40.0868 23.8537 17.8988 13.4158 23.7062 10.6272 19.1321 9.1846
temp: 298.150 k
press: 1.00000 atm
elementType: 8 8 8 8 8 6 6 6 6 6 6 6 6 6 6 6 6 6 6 6 6 6 6 6 6 6 6 1 1 1 1 1 1 1 1 1 1 1 1 1 1 1 1 1 1 1 1 1 1 1 1 1 1 1 1 1 1 1 1
symmnumber: 1
zpe: 1315781.2 jmol-1
zpe.correction: 0.501155 hartree
zpe.thermalcorrener: 0.528102 hartree
zpe.thermalcorrenthalpy: 0.529047 hartree
zpe.thermalcorrgfe: 0.446127 hartree
zpe.sumelectzpe: -1231.527825 hartree
zpe.sumelectthermal: -1231.500878 hartree
zpe.sumelectthermalent: -1231.499934 hartree
zpe.sumelectthermalfe: -1231.582853 hartree
dipole: -1.5734 3.3015 1.6722
dipole: 4.0214
quadrupole: -237.7502 -151.0110 -164.6843
quadrupole: -18.9890 12.9229 1.5040
quadrupole: -53.2684 33.4709 19.7975 -18.9890 12.9229 1.5040
hfenergy: -1232.0289801 hartree
pointgroup: C01 [X(C22H32O5)]
dipole: -0.5859488 -1.2946173 -0.6955999 debye
polarizability: 326.0629228|12.2942224|228.5780349|15.7374815|-3.9881585|188.3054682 unknown
InChI: InChI=1S/C22H32O5/c1-20-8-6-14(24)10-13(20)4-5-15-16(20)7-9-21(2)17(15)11-19(27-3)22(21,26)18(25)12-23/h10,15-17,19,23,26H,4-9,11-12H2,1-3H3
charge 0 multiplicity 1
59 atoms
O  -2.799478 0.394328 1.958799
O  -4.022525 -1.693382 -0.706182
O  -3.93675 2.127864 -0.565703
O  -6.440337 1.724786 0.315367
O  6.945577 0.335615 1.165334
C  -1.522948 0.429758 -0.235529
C  -0.701251 -0.782766 0.312038
C  0.720735 -0.883391 -0.274557
C  1.484206 0.445285 0.033761
C  -2.891143 0.163106 0.482204
C  -0.772284 1.728168 0.145225
C  2.978939 0.452362 -0.499622
C  -1.660711 -1.987684 0.152224
C  0.678283 1.699676 -0.412212
C  -3.086035 -1.389828 0.388268
C  1.490085 -2.085783 0.315089
C  -1.753723 0.363783 -1.773187
C  3.683228 -0.830144 -0.018388
C  2.942918 -2.140401 -0.21376
C  3.707283 1.707059 0.077847
C  3.033897 0.481121 -2.060831
C  -4.088315 1.038502 0.060284
C  5.245406 1.64322 -0.022554
C  4.941279 -0.824375 0.529589
C  5.797448 0.374808 0.624924
C  -5.486845 0.654005 0.534104
C  -4.443703 -3.096829 -0.710152
H  -0.584363 -0.60517 1.403692
H  0.65255 -1.025391 -1.373893
H  1.564649 0.491501 1.145481
H  -0.70679 1.826819 1.251174
H  -1.30469 2.616135 -0.241207
H  -1.608943 -2.388371 -0.878735
H  -1.434469 -2.809214 0.852555
H  0.636928 1.75215 -1.516308
H  1.197728 2.615108 -0.074229
H  -3.520694 -1.737001 1.349071
H  0.97463 -3.032772 0.065044
H  1.501411 -2.004111 1.421774
H  -0.806722 0.215762 -2.318388
H  -2.437186 -0.457123 -2.050887
H  -2.206263 1.306861 -2.121267
H  2.907093 -2.371569 -1.300289
H  3.503095 -2.964499 0.26445
H  3.429587 1.812806 1.146429
H  3.348096 2.615112 -0.440428
H  4.077308 0.409351 -2.415775
H  2.472656 -0.356258 -2.51097
H  2.609277 1.422605 -2.45108
H  -2.469415 1.318163 2.111921
H  5.719243 2.520074 0.452905
H  5.567399 1.646404 -1.084167
H  5.393923 -1.758268 0.888461
H  -5.45235 0.404442 1.611505
H  -5.777571 -0.258919 -0.024849
H  -5.169562 -3.195728 -1.532049
H  -4.927908 -3.370836 0.25077
H  -3.589585 -3.780213 -0.890218
H  -5.981798 2.407887 -0.251373
